program: Gaussian 09
title: 000271760
version: EM64L-G09RevD.01
frameworkgroup: C1[X(C15H20O4)]
method: RPBEPBE
basis: SDD
operation: Freq
keyword: #pfreq=noraman
keyword: PBEPBE/SDD
title: #p freq=noraman PBEPBE/SDD
converged: NO YES NO NO
title: Mulliken charges:
elementType: O O O O C C C C C C C C C C C C C C C H H H H H H H H H H H H H H H H H H H H
charge: -0.287183 -0.284346 -0.257690 -0.218942 -0.421489 0.003449 -0.198363 0.431692 -0.737933 -0.727608 0.151165 -0.366073 -0.350125 -0.251975 -0.219587 0.286359 -0.758193 0.239611 -0.745691 0.209205 0.250025 0.207667 0.269380 0.208338 0.236668 0.220404 0.213012 0.211733 0.213227 0.254662 0.250768 0.229210 0.233307 0.246689 0.244931 0.250590 0.266117 0.245502 0.251487
chargesum: 0.00000
title: Mulliken charges with hydrogens summed into heavy atoms:
elementType: O O O O C C C C C C C C C C C C C C C
charge: -0.287183 -0.284346 -0.257690 -0.218942 0.037742 0.211115 0.071017 0.431692 -0.072523 -0.089637 0.151165 -0.111412 -0.099357 -0.022765 0.013720 0.286359 -0.015983 0.239611 0.017416
polarizability: 1.90241469e+02 -9.60162240e+00 1.73786709e+02 -5.20019366e+00 1.98917624e+01 1.52767550e+02
1716.lowfreq: -4.5570 -0.0007 -0.0004 0.0005 5.7222 8.7901 22.8600 24.8205 30.2454
frequency: 22.6536 24.7598 30.2169 44.9212 53.6088 59.8527 66.1048 71.5410 82.1556 93.2026 106.8218 159.1407 183.1049 209.4623 211.1600 221.7164 241.0986 254.4709 300.3270 312.0354 321.9706 389.2294 405.0563 424.7684 442.4780 482.6314 512.4997 522.9216 548.2142 559.4503 564.3743 608.2085 614.2451 648.2663 721.4089 750.9727 776.2394 780.2541 811.7423 843.2797 870.7378 879.1044 896.8423 912.6590 924.4876 950.3713 955.8668 965.7185 986.8866 990.9039 993.8508 1037.0273 1040.7174 1041.0313 1051.5219 1076.7264 1132.0152 1148.5114 1159.1651 1170.1636 1177.2093 1181.3725 1200.7071 1215.6228 1244.0272 1267.3474 1289.0406 1316.3157 1329.3929 1336.8283 1357.8207 1379.7799 1381.7623 1384.4852 1394.7552 1398.3071 1438.6190 1448.3606 1451.9448 1452.7490 1453.1564 1454.5420 1469.7005 1471.6826 1476.6171 1482.7937 1496.0864 1587.0870 1616.5883 1644.1295 1669.5908 2966.4218 2968.8949 2973.2789 2982.5451 3005.1722 3008.1962 3041.0574 3060.3552 3063.1779 3067.9682 3070.4027 3073.6582 3096.7915 3096.9466 3133.7473 3142.5538 3145.8841 3145.9891 3159.7436 3173.5891
redmass: 4.7974 4.8744 1.1982 2.9318 2.6343 3.9292 3.7534 3.3236 2.3761 1.5054 4.9412 3.9234 2.5507 3.5545 1.2141 5.0355 1.3554 3.6107 3.2150 3.2282 3.5120 2.4151 2.5501 2.7660 3.6321 3.5274 3.9675 4.0306 3.2604 3.4357 3.5220 4.9307 5.6837 5.3002 4.6231 2.2573 2.0347 2.5232 3.5046 2.8703 1.9127 3.6375 2.8915 2.7974 1.2138 1.4376 1.4063 1.9195 1.3257 1.9935 1.8809 2.0778 1.6643 1.6648 2.6105 2.5643 2.4080 2.1430 2.3225 1.1470 1.7812 2.2967 3.3846 2.2358 1.4496 1.4737 1.4152 1.2479 1.4667 1.3845 1.7436 1.2706 1.2519 1.2490 2.6853 1.2591 2.2037 1.0929 1.0524 1.0600 1.0611 1.0507 1.0735 1.0509 2.4229 1.0558 1.0497 6.4785 7.0966 9.2633 9.9017 1.0353 1.0362 1.0827 1.0599 1.0381 1.0373 1.0996 1.0999 1.0989 1.0992 1.0988 1.0868 1.0966 1.0947 1.0855 1.1020 1.1007 1.0910 1.0951 1.1002
irintensity: 1.3532 0.5250 0.3611 0.8333 2.7427 0.1417 5.0421 0.6700 0.7057 1.0916 3.3604 1.6501 1.3536 2.4671 0.1671 8.5291 0.7577 1.5343 1.6075 1.5251 1.5699 0.5668 2.2197 2.4094 1.3119 21.4033 7.1130 6.4863 2.5994 5.9011 5.7073 7.5004 5.0442 10.2358 3.2221 18.1588 25.1771 31.4648 16.4751 4.8049 11.2852 38.6788 23.9010 91.4299 14.0490 3.4778 0.1593 1.9108 0.1242 74.6686 73.5585 8.5769 11.3002 9.0758 31.6967 53.2159 23.4665 21.6448 250.6778 17.1221 12.1831 123.1618 296.3284 20.7322 0.3546 4.8794 8.0973 1.2052 9.4134 8.6782 8.6365 19.1715 56.0591 66.8147 0.0850 19.9343 10.9705 8.2708 16.5056 25.7243 26.0845 20.1335 4.0403 8.2014 31.3404 5.6138 22.2679 4.9491 2.7650 155.8698 166.2756 36.8589 27.1000 15.4874 21.1953 2.6050 0.7589 3.9900 15.8917 17.5490 55.4732 78.4633 17.4085 5.4557 8.9492 0.7949 9.9359 11.5253 8.3503 17.6124 15.4914
temp: 298.150 k
press: 1.00000 atm
elementType: 8 8 8 8 6 6 6 6 6 6 6 6 6 6 6 6 6 6 6 1 1 1 1 1 1 1 1 1 1 1 1 1 1 1 1 1 1 1 1
symmnumber: 1
zpe: 834429.2 jmol-1
zpe.correction: 0.317817 hartree
zpe.thermalcorrener: 0.339019 hartree
zpe.thermalcorrenthalpy: 0.339963 hartree
zpe.thermalcorrgfe: 0.264548 hartree
zpe.sumelectzpe: -883.066713 hartree
zpe.sumelectthermal: -883.045512 hartree
zpe.sumelectthermalent: -883.044568 hartree
zpe.sumelectthermalfe: -883.119983 hartree
dipole: 0.6679 -1.4638 -0.1238
dipole: 1.6138
quadrupole: -102.9833 -102.5799 -117.8738
quadrupole: 2.4251 1.2890 7.2033
quadrupole: 4.8290 5.2324 -10.0614 2.4251 1.2890 7.2033
hfenergy: -883.3845307 hartree
pointgroup: C01 [X(C15H20O4)]
dipole: 0.3044944 0.531356 0.1675003 debye
polarizability: 187.4559764|2.0872482|167.8007849|14.8433009|21.4516573|161.5389664 unknown
InChI: InChI=1S/C15H20O4/c1-10(2)9-15(19-12(4)17)13-7-5-6-8-14(13)18-11(3)16/h5-8,10,15H,9H2,1-4H3
charge 0 multiplicity 1
39 atoms
O  -1.036856 1.699876 -0.348631
O  1.674496 -1.343805 -0.852126
O  -1.026051 1.036576 -2.594693
O  0.270084 -2.770963 0.372551
C  -1.663515 -0.169153 1.119369
C  -3.105266 -0.33094 0.570263
C  -0.624281 0.313124 0.091642
C  0.779796 0.415502 0.665191
C  -3.186549 -1.374864 -0.570809
C  -4.053814 -0.717229 1.730344
C  1.84142 -0.414573 0.230766
C  1.070259 1.372999 1.67084
C  3.14185 -0.306132 0.761734
C  2.364419 1.496428 2.216417
C  3.405721 0.653413 1.761335
C  -1.170185 1.92611 -1.724566
C  -1.487174 3.382827 -1.986526
C  0.853744 -2.49039 -0.691749
C  0.810695 -3.256876 -1.991608
H  -1.671737 0.537784 1.97286
H  -1.305137 -1.142915 1.506899
H  -3.432224 0.651114 0.169929
H  -0.633447 -0.31924 -0.810891
H  -4.237184 -1.529509 -0.879836
H  -2.624049 -1.056067 -1.467251
H  -2.78268 -2.349653 -0.235767
H  -3.76788 -1.697382 2.158365
H  -4.021165 0.030522 2.545161
H  -5.099781 -0.793723 1.379916
H  0.268391 2.040322 2.004104
H  3.927305 -0.966834 0.382444
H  2.563935 2.247348 2.988249
H  4.414871 0.743592 2.177014
H  -2.217753 3.763081 -1.254807
H  -1.866488 3.501911 -3.011842
H  -0.564419 3.981928 -1.87765
H  0.303854 -2.647348 -2.761098
H  0.266663 -4.201413 -1.850274
H  1.832931 -3.455646 -2.354666
