program: Gaussian 09
title: 000271723
version: EM64L-G09RevD.01
frameworkgroup: C1[X(C11H15O3P)]
method: RPBEPBE
basis: SDD
operation: Freq
keyword: #p
keyword: freq=noraman
keyword: PBEPBE/SDD
title: #p freq=noraman PBEPBE/SDD
converged: NO YES NO NO
title: Mulliken charges:
elementType: P O O O C C C C C C C C C C C H H H H H H H H H H H H H H H
charge: 1.061323 -0.539833 -0.559726 -0.562484 -0.530607 0.003754 0.036002 -0.694963 -0.691282 0.340806 -0.360340 -0.361873 -0.203280 -0.193009 -0.254712 0.215561 0.283344 0.229328 0.226776 0.206266 0.238266 0.241522 0.243886 0.235702 0.200116 0.262871 0.248442 0.224635 0.226298 0.227210
chargesum: 0.00000
title: Mulliken charges with hydrogens summed into heavy atoms:
elementType: P O O O C C C C C C C C C C C
charge: 1.061323 -0.539833 -0.559726 -0.562484 -0.031702 0.233082 0.262778 -0.008909 -0.011579 0.340806 -0.097469 -0.113431 0.021355 0.033289 -0.027502
polarizability: 2.06971386e+02 -3.15944611e-01 1.48272806e+02 4.66240288e+00 -5.84684029e-01 9.78455357e+01
1716.lowfreq: -15.2129 -1.4226 0.0023 0.0025 0.0025 6.7055 26.0897 35.1245 40.4577
frequency: 25.5524 34.8424 40.2778 80.5056 109.5844 154.0122 185.9109 207.9486 223.8170 230.1941 239.9872 295.8651 332.0692 368.9832 383.7466 400.6567 411.2264 434.0504 476.1303 499.8413 539.5889 590.3458 592.9224 616.2762 623.4806 656.3501 693.5003 760.1298 782.2792 809.1775 813.4186 833.6816 882.3726 901.9168 912.9385 927.2409 963.9645 983.0861 983.3114 984.5872 1021.0694 1028.7265 1077.1277 1086.1148 1120.7780 1142.2502 1151.9167 1165.5959 1177.2006 1197.7223 1243.8728 1286.6790 1309.9710 1311.8887 1312.2083 1330.1710 1377.4535 1378.1676 1386.3042 1389.9699 1439.3507 1444.1655 1457.9700 1460.2083 1471.9437 1479.5414 1482.3165 1588.3254 1602.6295 2986.7882 2987.8299 3002.5903 3010.3748 3026.5393 3069.4002 3085.0790 3085.7874 3101.0976 3107.8846 3126.0709 3134.1175 3147.7167 3159.5872 3171.1138
redmass: 3.6033 4.6692 4.0690 5.5241 4.6083 2.9696 4.8300 2.4633 1.0964 1.3463 5.1550 3.1539 3.5336 3.1094 6.8944 4.1013 2.9446 5.0351 3.6805 3.1329 5.3746 7.4706 7.1145 5.4780 7.2982 2.8323 2.1835 1.5974 3.9574 5.5713 4.6306 1.2502 2.1764 1.4341 2.0661 2.1619 1.3726 1.5662 1.4830 3.1295 2.1096 1.3714 1.5574 2.6708 1.9904 1.8318 2.3129 1.1151 1.2253 2.6767 1.3437 1.4327 1.3201 1.1735 1.2315 1.4787 1.4019 7.1444 1.2306 1.2633 2.3211 1.0824 1.0513 1.0562 2.1835 1.0500 1.0482 6.4038 6.2222 1.0370 1.0366 1.0621 1.0861 1.0858 1.1008 1.0979 1.0980 1.1001 1.1012 1.0847 1.0887 1.0937 1.0964 1.1002
irintensity: 0.6177 0.6677 0.4602 1.4309 3.6880 1.6101 1.8435 1.6274 0.1243 2.2981 5.9743 1.9725 2.3399 3.1422 39.3647 10.7971 0.3235 6.3878 10.1086 27.1193 20.3531 118.0210 33.2616 41.2393 14.2960 13.0628 27.9301 77.1885 97.0580 176.0249 40.9344 0.8813 81.1556 6.4299 85.3912 27.4714 0.0403 1.6155 0.7684 0.4904 18.7044 7.8089 21.2368 146.2688 51.5891 5.6962 24.1603 16.1422 49.6095 179.5137 14.5463 13.8956 1.2196 5.5428 13.5964 11.9839 11.8504 3.0193 15.1089 29.0815 5.5079 18.1604 2.6153 11.1763 137.2317 11.5830 9.4439 18.0373 89.3049 18.0886 18.4565 18.1498 32.6699 28.3687 13.9369 3.1154 59.8384 22.7686 27.8849 2.9094 10.7246 20.7040 25.7128 12.2267
temp: 298.150 k
press: 1.00000 atm
elementType: 15 8 8 8 6 6 6 6 6 6 6 6 6 6 6 1 1 1 1 1 1 1 1 1 1 1 1 1 1 1
symmnumber: 1
zpe: 628693.7 jmol-1
zpe.correction: 0.239457 hartree
zpe.thermalcorrener: 0.254743 hartree
zpe.thermalcorrenthalpy: 0.255688 hartree
zpe.thermalcorrgfe: 0.195726 hartree
zpe.sumelectzpe: -993.945897 hartree
zpe.sumelectthermal: -993.930610 hartree
zpe.sumelectthermalent: -993.929666 hartree
zpe.sumelectthermalfe: -993.989628 hartree
dipole: 1.7448 -0.0526 -2.3091
dipole: 2.8946
quadrupole: -83.3256 -93.0054 -99.3632
quadrupole: -0.1426 -5.0170 -0.5083
quadrupole: 8.5725 -1.1073 -7.4652 -0.1426 -5.0170 -0.5083
hfenergy: -994.1853538 hartree
pointgroup: C01 [X(C11H15O3P1)]
dipole: 0.7749293 0.0921008 0.8294325 debye
polarizability: 204.9171298|-1.9646813|147.7365716|-15.4264605|-5.0939374|100.4360258 unknown
InChI: InChI=1S/C11H15O3P/c1-9-8-10(2)13-15(12-9)14-11-6-4-3-5-7-11/h3-7,9-10H,8H2,1-2H3
charge 0 multiplicity 1
30 atoms
P  0.774546 -0.052149 -1.827265
O  1.41042 1.342113 -0.963115
O  2.096999 -1.161701 -1.707039
O  -0.237392 -0.848047 -0.520652
C  2.556616 -0.257799 0.610282
C  2.502986 1.187546 0.058101
C  2.903985 -1.332699 -0.442957
C  3.810977 1.688703 -0.572228
C  2.681961 -2.761863 0.058941
C  -1.554716 -0.410851 -0.264161
C  -1.934279 0.954293 -0.326377
C  -2.494723 -1.402346 0.10875
C  -3.269341 1.313613 -0.030283
C  -3.81945 -1.025448 0.415892
C  -4.215795 0.332126 0.342668
H  3.320061 -0.301818 1.409954
H  1.57895 -0.502515 1.062717
H  2.195991 1.869582 0.872069
H  3.946256 -1.207491 -0.792967
H  4.623401 1.697719 0.178649
H  4.119723 1.055147 -1.421633
H  3.672806 2.716583 -0.947487
H  1.633056 -2.896274 0.37338
H  2.903972 -3.484476 -0.744498
H  3.346367 -2.977346 0.917422
H  -1.193591 1.722069 -0.577027
H  -2.173074 -2.447823 0.146261
H  -3.564111 2.367975 -0.082006
H  -4.544586 -1.794417 0.705662
H  -5.246418 0.619597 0.576444
