program: Gaussian 09
title: 000271725
version: EM64L-G09RevD.01
frameworkgroup: C1[X(C8H17O3P)]
method: RPBEPBE
basis: SDD
operation: Freq
keyword: #p
keyword: freq=noraman
keyword: PBEPBE/SDD
title: #p freq=noraman PBEPBE/SDD
converged: YES YES NO NO
title: Mulliken charges:
elementType: P O O O C C C C C C C C H H H H H H H H H H H H H H H H H
charge: 1.009356 -0.542351 -0.535552 -0.523944 0.284592 0.260368 -0.723295 -0.723852 -0.726845 -0.723714 -0.234241 -0.639878 0.236813 0.230438 0.214110 0.229402 0.202182 0.254252 0.204495 0.245728 0.231273 0.204058 0.227224 0.270228 0.217648 0.190835 0.201717 0.225559 0.233393
chargesum: 0.00000
title: Mulliken charges with hydrogens summed into heavy atoms:
elementType: P O O O C C C C C C C C
charge: 1.009356 -0.542351 -0.535552 -0.523944 0.284592 0.260368 -0.041933 -0.038016 -0.045349 -0.022204 0.174242 0.020791
polarizability: 1.55551785e+02 -1.83315919e+00 1.06000040e+02 1.19763689e+00 1.10128302e+00 1.03388938e+02
1716.lowfreq: -11.5309 -6.4044 -0.0007 -0.0004 0.0006 14.0617 26.0522 44.7504 68.6477
frequency: 21.2474 44.5480 68.6271 116.1983 159.4645 193.3939 195.2168 195.8054 232.7699 245.9217 272.1021 276.6519 279.4997 299.3910 329.8386 347.2780 362.2858 372.9729 388.7691 460.1968 494.9967 531.7165 543.0903 613.7373 617.2138 630.2650 708.1282 764.8776 805.4539 820.5427 877.4210 915.3169 931.1662 941.6208 950.3409 994.7087 1002.5369 1021.7913 1096.6285 1125.2480 1136.5686 1138.5078 1170.8078 1213.2163 1244.1353 1262.8784 1266.9930 1352.3707 1376.0907 1381.9148 1390.3284 1390.7836 1400.7908 1447.0745 1454.2005 1458.4611 1461.0987 1464.9707 1472.4914 1478.7980 1480.3014 1485.2675 1486.2628 1496.8269 2955.9417 2988.2782 2989.1469 2989.7800 2992.8679 2995.2358 3032.9372 3083.5402 3084.8678 3086.0509 3087.1085 3091.0820 3097.2537 3103.8960 3107.6034 3114.7915 3116.2179
redmass: 3.0494 2.7965 2.9596 4.2820 3.3296 1.6065 1.2015 1.5092 2.1434 1.9797 1.4830 2.1295 1.3912 1.1068 2.5295 2.5986 3.1336 3.3833 3.5274 3.1770 3.6854 6.7405 4.2285 5.3069 5.9312 6.3084 4.3096 5.2420 1.1343 4.1656 3.2037 2.1251 1.4349 1.6230 1.7504 1.2674 1.3234 2.9263 2.1440 2.0089 1.9575 1.5377 2.4358 3.4412 4.1773 1.1373 3.1120 1.2444 1.2418 1.2246 1.2174 1.2344 1.1953 1.0508 1.0485 1.0416 1.0484 1.0493 1.0595 1.0504 1.0613 1.0683 1.0517 1.0533 1.0621 1.0358 1.0366 1.0366 1.0375 1.0372 1.1011 1.0984 1.0982 1.0980 1.0991 1.0979 1.0997 1.1017 1.1005 1.0992 1.0994
irintensity: 0.9074 2.1795 3.3789 1.1285 0.3553 0.1484 0.0550 0.3837 0.5995 0.4876 0.1150 0.1065 0.2117 1.0182 1.0612 0.3326 1.2514 5.8113 17.5917 7.8277 0.3572 17.1638 8.9503 6.8990 108.2436 75.7421 70.5198 18.2246 6.1933 273.7484 76.5953 1.5095 0.4261 9.1090 5.6382 0.5621 0.4389 152.1034 9.7956 7.5493 85.0129 8.4922 49.2699 11.8590 0.3868 0.3245 1.1420 25.3280 14.9006 32.0542 34.3534 23.4184 21.6816 0.2621 4.9140 12.2053 26.3632 1.7934 2.8090 6.4084 6.5521 9.6896 7.0714 10.3535 60.7938 11.0096 31.2796 17.8316 10.6819 45.4364 27.3142 4.0310 9.0454 44.2012 16.5323 55.8968 25.2480 36.1689 12.5357 15.4032 24.4731
temp: 298.150 k
press: 1.00000 atm
elementType: 15 8 8 8 6 6 6 6 6 6 6 6 1 1 1 1 1 1 1 1 1 1 1 1 1 1 1 1 1
symmnumber: 1
zpe: 634479.7 jmol-1
zpe.correction: 0.241661 hartree
zpe.thermalcorrener: 0.256906 hartree
zpe.thermalcorrenthalpy: 0.257850 hartree
zpe.thermalcorrgfe: 0.199597 hartree
zpe.sumelectzpe: -880.976348 hartree
zpe.sumelectthermal: -880.961102 hartree
zpe.sumelectthermalent: -880.960158 hartree
zpe.sumelectthermalfe: -881.018411 hartree
dipole: 0.4860 0.4225 0.2242
dipole: 0.6819
quadrupole: -67.6202 -83.5484 -82.2505
quadrupole: -1.5529 3.5340 2.3309
quadrupole: 10.1862 -5.7421 -4.4441 -1.5529 3.5340 2.3309
hfenergy: -881.2180081 hartree
pointgroup: C01 [X(C8H17O3P1)]
dipole: 0.1747146 0.2014104 0.0295594 debye
polarizability: 155.4411397|3.134952|106.5495276|-0.4609087|0.225191|102.9500967 unknown
InChI: InChI=1S/C8H17O3P/c1-6-9-12-10-7(2,3)8(4,5)11-12/h6H2,1-5H3
charge 0 multiplicity 1
29 atoms
P  -0.848943 -0.604241 -0.954857
O  0.244166 -1.147085 0.332616
O  0.227692 0.749712 -1.367017
O  -2.051759 0.078006 0.160975
C  1.569389 -0.424074 0.287849
C  1.223243 1.017962 -0.25758
C  2.493498 -1.221783 -0.655542
C  2.094483 -0.441381 1.729773
C  2.401751 1.735147 -0.929262
C  0.544167 1.919979 0.793444
C  -3.47154 0.112329 -0.270381
C  -4.333359 -0.473309 0.850286
H  2.487569 -2.280028 -0.343461
H  2.146881 -1.165433 -1.702594
H  3.533769 -0.852522 -0.609971
H  2.313102 -1.479704 2.032079
H  3.027186 0.147518 1.809615
H  1.349026 -0.030581 2.427949
H  3.228852 1.879762 -0.209295
H  2.776319 1.168952 -1.796349
H  2.0754 2.727996 -1.28257
H  1.275602 2.269305 1.544937
H  0.126017 2.803594 0.281341
H  -0.282678 1.398299 1.302702
H  -3.731919 1.169673 -0.464212
H  -3.605576 -0.457473 -1.214687
H  -5.406556 -0.394603 0.59233
H  -4.087316 -1.535306 1.021956
H  -4.160566 0.077287 1.790928
