program: Gaussian 09
title: 000271716
version: EM64L-G09RevD.01
frameworkgroup: C1[X(C15H15NO)]
method: RPBEPBE
basis: SDD
operation: Freq
keyword: #p
keyword: freq=noraman
keyword: PBEPBE/SDD
title: #p freq=noraman PBEPBE/SDD
converged: YES YES NO NO
title: Mulliken charges:
elementType: O N C C C C C C C C C C C C C C C H H H H H H H H H H H H H H H
charge: -0.450599 -0.091880 -0.669329 0.091094 0.310753 0.506973 -0.345533 -0.360605 0.449234 -0.403334 -0.423238 -0.447048 -0.382458 -0.224476 -0.222144 -0.808075 -0.249422 0.255601 0.224886 0.307774 0.248058 0.229033 0.229887 0.233644 0.251252 0.224651 0.224266 0.225494 0.226229 0.238160 0.227188 0.373963
chargesum: 0.00000
title: Mulliken charges with hydrogens summed into heavy atoms:
elementType: O N C C C C C C C C C C C C C C C
charge: -0.076636 -0.091880 -0.188843 0.091094 0.310753 0.506973 -0.037759 -0.112547 0.449234 -0.174301 -0.193351 -0.213404 -0.131205 0.000176 0.002122 -0.118192 -0.022234
polarizability: 1.96931639e+02 2.16639593e+00 1.97980019e+02 7.29749734e+00 1.25903975e+01 1.25888884e+02
1716.lowfreq: -7.7430 -5.7022 -0.0007 0.0003 0.0010 4.8285 16.4506 29.0780 30.3032
frequency: 16.3661 29.0325 30.2917 47.5857 68.7765 101.3202 163.0611 217.6999 248.9992 257.7955 272.4234 323.3815 341.2438 372.0172 403.1945 405.2509 436.2037 442.1912 468.5886 474.0879 557.8266 599.7049 621.5022 637.8751 655.7835 685.8087 707.7637 729.0055 754.4409 798.7074 803.8732 837.0288 852.9666 856.5939 865.6560 915.9170 961.0474 962.6725 979.2074 987.6772 989.9646 991.9851 996.7685 1012.0558 1026.7816 1046.4094 1057.3503 1082.0366 1134.6869 1171.0254 1185.1138 1188.0197 1204.6450 1208.7978 1234.0364 1260.7718 1278.7094 1302.1343 1325.2302 1335.2685 1368.5897 1381.9294 1395.4432 1412.6993 1440.1652 1458.7169 1469.1098 1472.2334 1483.1641 1503.9469 1561.0641 1571.8967 1594.0235 1613.3553 1622.1042 2974.4831 2994.5790 3048.0510 3055.8854 3085.8207 3109.6837 3121.8620 3123.4040 3124.8477 3135.1227 3145.9123 3162.2566 3169.4725 3210.2197 3558.0772
redmass: 4.1859 1.0566 3.3212 4.1930 5.1442 4.2090 4.4732 4.2295 5.3250 4.0482 7.1764 5.1416 2.5992 3.7201 2.6722 2.8290 1.8800 2.2685 2.6447 2.2728 4.3462 4.7626 5.9957 6.2848 4.8940 4.2417 1.7797 2.4387 2.1726 3.9363 3.6854 1.6943 1.3205 1.2497 3.4321 1.5950 2.2653 1.3610 1.3826 1.4249 5.2258 1.4208 1.3296 3.3485 2.2365 1.5846 3.1433 1.5893 1.3816 1.0626 1.2205 1.1173 2.5934 1.1907 2.6119 3.0839 1.4060 1.3512 1.3204 1.3323 5.3080 7.5279 1.2256 3.1855 2.1362 1.1367 1.1049 1.0552 2.1915 2.4685 5.2233 5.9249 6.0309 6.0570 6.2270 1.0387 1.0593 1.1007 1.0946 1.0999 1.0875 1.0902 1.0858 1.0903 1.0912 1.0958 1.1015 1.0932 1.0933 1.0673
irintensity: 0.0387 0.4639 0.1123 0.2833 0.2797 1.0465 0.3624 1.3387 0.1446 0.2491 0.1331 0.7914 1.2536 2.9896 6.5510 0.0346 80.9587 36.5979 14.6605 8.0485 25.9440 24.2419 9.6651 0.7693 1.7781 21.6427 60.8292 25.3587 43.4198 8.8239 9.0782 25.8737 15.9713 0.5005 71.2803 24.8021 58.0278 3.3607 0.0923 4.7177 0.4882 3.7902 1.5983 4.6975 9.2415 19.6935 10.8364 17.7845 0.9825 0.5708 17.5054 1.9852 4.7499 10.0613 0.8714 27.6168 52.0498 19.5485 4.1991 1.0325 5.7643 0.2133 10.9635 3.0700 6.1199 28.5988 15.1211 11.8938 21.1200 24.1706 10.1261 2.4231 0.4403 12.8315 28.1118 33.9603 15.9715 10.2460 22.9098 16.7624 10.4917 21.3648 0.4629 18.8682 16.1688 34.6706 25.1542 6.6117 5.1936 53.5211
temp: 298.150 k
press: 1.00000 atm
elementType: 8 7 6 6 6 6 6 6 6 6 6 6 6 6 6 6 6 1 1 1 1 1 1 1 1 1 1 1 1 1 1 1
symmnumber: 1
zpe: 677627.5 jmol-1
zpe.correction: 0.258095 hartree
zpe.thermalcorrener: 0.273628 hartree
zpe.thermalcorrenthalpy: 0.274573 hartree
zpe.thermalcorrgfe: 0.212350 hartree
zpe.sumelectzpe: -709.317560 hartree
zpe.sumelectthermal: -709.302026 hartree
zpe.sumelectthermalent: -709.301082 hartree
zpe.sumelectthermalfe: -709.363305 hartree
dipole: 0.6195 -0.9458 0.0939
dipole: 1.1346
quadrupole: -93.5099 -88.2186 -96.7035
quadrupole: 1.5189 1.5681 4.5392
quadrupole: -0.6992 4.5921 -3.8929 1.5189 1.5681 4.5392
hfenergy: -709.5756546 hartree
pointgroup: C01 [X(C15H15N1O1)]
dipole: 0.2746067 0.3328444 -0.1142604 debye
polarizability: 196.1479005|-3.2728777|200.6550676|-7.6594562|-2.0600645|123.9975734 unknown
InChI: InChI=1S/C15H15NO/c1-12-7-9-14(10-8-12)15(16-17)11-13-5-3-2-4-6-13/h2-10,17H,11H2,1H3
charge 0 multiplicity 1
32 atoms
O  0.859926 -3.565733 0.275133
N  -0.210774 -2.763988 0.884312
C  -1.168474 -0.737833 1.563706
C  0.022955 -1.454708 0.915873
C  1.201422 -0.675454 0.458531
C  -2.041785 0.078721 0.606767
C  2.406075 -1.269544 -0.030676
C  1.160843 0.75023 0.529143
C  3.452231 0.944898 -0.350599
C  3.5001 -0.470616 -0.417393
C  2.258062 1.537701 0.13455
C  -2.562145 1.335041 1.008685
C  -2.390006 -0.424587 -0.671942
C  -3.412796 2.073527 0.154933
C  -3.236478 0.312709 -1.529201
C  4.623303 1.795756 -0.805972
C  -3.751998 1.564876 -1.119722
H  -1.792053 -1.527052 2.024046
H  -0.810729 -0.091797 2.387604
H  2.476807 -2.354494 -0.096301
H  0.255872 1.254132 0.878824
H  4.412914 -0.959011 -0.780841
H  2.187215 2.630284 0.200616
H  -2.304132 1.735524 1.997851
H  -1.993849 -1.395232 -0.991384
H  -3.807239 3.042425 0.48215
H  -3.494639 -0.088639 -2.515981
H  4.664081 2.755147 -0.26081
H  5.585265 1.274051 -0.658363
H  4.542121 2.034434 -1.884672
H  -4.408438 2.13642 -1.785463
H  0.485247 -4.480486 0.352191
