program: Gaussian 09
title: 000271721
version: EM64L-G09RevD.01
frameworkgroup: C1[X(C16H14O2)]
method: RPBEPBE
basis: SDD
operation: Freq
keyword: #pfreq=noraman
keyword: PBEPBE/SDD
title: #p freq=noraman PBEPBE/SDD
converged: YES YES NO NO
title: Mulliken charges:
elementType: O O C C C C C C C C C C C C C C C C H H H H H H H H H H H H H H
charge: -0.212990 -0.203399 0.347375 0.222118 0.468727 -0.615611 -0.317110 -0.391236 -0.013889 -0.793346 -0.010053 -0.807245 0.323529 -0.325868 -0.357686 -0.238583 -0.228255 -0.224872 0.239852 0.251984 0.237570 0.250721 0.249257 0.212956 0.228733 0.233427 0.238790 0.258267 0.275711 0.232781 0.234275 0.234068
chargesum: 0.00000
title: Mulliken charges with hydrogens summed into heavy atoms:
elementType: O O C C C C C C C C C C C C C C C C
charge: -0.212990 -0.203399 0.347375 0.222118 0.468727 -0.375758 -0.065125 -0.153666 -0.013889 -0.080413 -0.010053 -0.106296 0.323529 -0.067600 -0.081975 -0.005801 0.006020 0.009196
polarizability: 2.72519059e+02 3.70427574e+00 1.66971253e+02 -3.15209083e+00 -1.14747525e+01 1.21246278e+02
1716.lowfreq: -26.6860 -4.5107 -1.0927 -0.0006 -0.0006 -0.0005 5.5577 20.3847 30.3838
frequency: -26.4578 20.2937 30.3078 38.8534 88.7138 127.0777 148.9270 153.5377 182.1775 204.6389 232.5454 251.9661 272.9081 299.7986 335.8300 376.5490 399.3858 428.2337 438.6294 448.3161 465.5911 538.1860 546.2114 603.2234 612.1448 661.2603 689.4966 694.5825 711.2885 724.2711 760.8646 791.1490 821.3513 853.1736 859.4481 890.4260 935.2388 949.3991 969.8530 987.2799 988.7079 992.9974 1008.4536 1011.1188 1022.3374 1032.0244 1041.3603 1047.3050 1086.7206 1144.2913 1174.1249 1187.0652 1190.1229 1215.9060 1248.7602 1290.7150 1297.2369 1321.4316 1375.4614 1388.9122 1391.4426 1397.1518 1408.1594 1435.0521 1450.5705 1463.1733 1468.0446 1474.5066 1477.6639 1490.6822 1529.8485 1545.3217 1571.2980 1588.5656 1608.5276 1620.4068 2979.1351 2988.5134 3057.6131 3072.5967 3088.7586 3090.4292 3120.2576 3129.8739 3131.5572 3141.7973 3153.2378 3164.1113 3169.8792 3175.1722
redmass: 1.0306 5.4070 4.2476 3.8978 4.3486 5.7520 5.0639 5.0070 1.5030 1.8419 4.7973 5.1237 3.8732 3.8743 7.8352 5.7871 2.8412 5.1252 3.1495 3.1676 3.9884 4.9089 3.3866 6.1020 6.4457 5.9326 2.8625 3.1323 3.2702 3.3644 3.1058 3.0389 1.7389 3.1618 1.2525 1.2734 3.5526 1.4422 1.3723 1.4693 4.4019 1.5030 1.7919 2.6110 1.5740 2.2765 1.5800 1.6141 1.5824 1.8584 1.0670 1.6996 1.1554 2.8585 2.6693 4.5586 1.5004 1.3394 5.4078 8.5201 1.9383 1.3016 1.3672 2.3059 1.0503 1.1951 1.0500 1.1892 2.2201 2.8347 6.4906 10.0942 6.8551 6.3814 6.0328 6.0662 1.0376 1.0365 1.0969 1.0955 1.1014 1.0991 1.0912 1.0855 1.0898 1.0887 1.0934 1.0974 1.0944 1.0987
irintensity: 0.4596 2.3889 0.8690 0.4329 0.3357 0.8382 1.0678 0.2238 3.4315 0.7051 1.3648 6.7955 13.3468 13.2007 1.5649 0.3762 0.0573 1.4735 1.4161 8.3734 4.9310 7.0083 2.4748 37.6553 0.0613 48.5704 15.7834 37.7045 19.3750 34.6121 18.5156 61.6802 52.4946 38.8468 0.5869 3.1169 15.8520 1.4702 0.1004 5.5695 1.7290 1.1756 0.5949 2.2801 2.9787 1.3256 3.2070 21.4194 8.5927 49.6734 4.8996 7.9923 58.2515 235.1242 10.1151 16.0909 3.3048 3.0728 37.2006 5.5722 4.9058 10.7836 17.3023 19.1934 13.7075 7.9049 15.9400 39.8944 1.7629 19.2502 202.4448 246.5067 38.6825 12.4027 14.0995 98.7253 24.4893 17.1379 15.9141 9.5606 27.6170 21.0791 28.2353 0.2594 13.3168 8.2873 11.9414 28.5028 5.3592 12.7729
temp: 298.150 k
press: 1.00000 atm
elementType: 8 8 6 6 6 6 6 6 6 6 6 6 6 6 6 6 6 6 1 1 1 1 1 1 1 1 1 1 1 1 1 1
symmnumber: 1
zpe: 657895.4 jmol-1
zpe.correction: 0.250579 hartree
zpe.thermalcorrener: 0.266287 hartree
zpe.thermalcorrenthalpy: 0.267231 hartree
zpe.thermalcorrgfe: 0.205754 hartree
zpe.sumelectzpe: -767.289848 hartree
zpe.sumelectthermal: -767.274141 hartree
zpe.sumelectthermalent: -767.273197 hartree
zpe.sumelectthermalfe: -767.334674 hartree
dipole: -1.1107 -1.2120 -3.3819
dipole: 3.7603
quadrupole: -75.9221 -103.3565 -109.3417
quadrupole: -1.6672 -2.7441 -1.0851
quadrupole: 20.2847 -7.1498 -13.1349 -1.6672 -2.7441 -1.0851
hfenergy: -767.5404273 hartree
pointgroup: C01 [X(C16H14O2)]
dipole: 0.4291931 -1.3424172 0.4498517 debye
polarizability: 272.5678304|-0.4936439|127.5621355|-4.1630499|19.5242631|160.6066245 unknown
InChI: InChI=1S/C16H14O2/c1-11-8-9-14(12(2)10-11)16(18)15(17)13-6-4-3-5-7-13/h3-10H,1-2H3
charge 0 multiplicity 1
32 atoms
O  -0.288828 1.637795 1.270509
O  -0.896291 0.756948 -1.894752
C  2.496563 0.64225 0.954135
C  1.371198 0.232949 0.15666
C  3.914102 -1.029522 -0.227444
C  3.737661 -0.003745 0.733643
C  1.549478 -0.795562 -0.817208
C  2.791027 -1.420021 -1.004512
C  0.022088 0.817392 0.347929
C  2.42149 1.730918 2.006503
C  -1.101148 0.492357 -0.670771
C  5.264913 -1.68667 -0.434542
C  -2.41145 -0.021408 -0.172351
C  -2.628428 -0.370587 1.189192
C  -3.461256 -0.201773 -1.116402
C  -3.874007 -0.894435 1.594082
C  -4.704048 -0.720453 -0.707654
C  -4.913063 -1.069069 0.64995
H  4.59987 0.308609 1.335889
H  0.702059 -1.097343 -1.438936
H  2.898338 -2.208204 -1.758823
H  2.029058 2.674686 1.588937
H  1.722279 1.462231 2.818072
H  3.419656 1.91644 2.439659
H  6.007477 -1.336291 0.301864
H  5.19156 -2.786833 -0.350259
H  5.660315 -1.466623 -1.444472
H  -1.835863 -0.216592 1.926992
H  -3.272998 0.073276 -2.159767
H  -4.038824 -1.159785 2.643855
H  -5.509628 -0.854554 -1.437676
H  -5.880404 -1.473281 0.969102
