program: Gaussian 09
title: 000271718
version: EM64L-G09RevD.01
frameworkgroup: C1[X(C16H17N3O)]
method: RPBEPBE
basis: SDD
operation: Freq
keyword: #p
keyword: freq=noraman
keyword: PBEPBE/SDD
title: #p freq=noraman PBEPBE/SDD
converged: YES YES NO NO
title: Mulliken charges:
elementType: O N N N C C C C C C C C C C C C C C C C H H H H H H H H H H H H H H H H H
charge: -0.254739 0.054988 -0.411133 -0.651001 -0.634351 0.007659 0.284294 0.468741 -0.412008 -0.369625 0.433549 -0.391054 -0.390446 -0.428662 -0.386278 -0.229961 -0.222242 -0.804762 -0.248795 0.290123 0.255107 0.216541 0.272180 0.265231 0.235287 0.235220 0.234710 0.265020 0.225181 0.226390 0.239981 0.225384 0.227721 0.227096 0.300331 0.342173 0.302152
chargesum: 0.00000
title: Mulliken charges with hydrogens summed into heavy atoms:
elementType: O N N N C C C C C C C C C C C C C C C C
charge: -0.254739 0.054988 -0.110802 -0.006676 -0.162703 0.007659 0.284294 0.468741 -0.139828 -0.104394 0.433549 -0.155767 -0.155226 -0.193952 -0.121259 -0.004781 0.004147 -0.111676 -0.021699 0.290123
polarizability: 2.31714355e+02 -1.41749761e+01 2.34751917e+02 1.10716223e+01 1.78306603e+00 1.40309770e+02
1716.lowfreq: -19.1559 -9.4833 -6.1596 -3.3414 -0.0005 0.0002 0.0004 13.2019 27.7042
frequency: -19.0192 12.3660 27.6100 32.1873 44.5092 44.9815 55.6940 106.3233 121.5384 154.9271 191.5156 208.8971 242.9546 271.0184 290.5750 331.6548 349.0886 364.0442 402.3439 403.9757 423.6363 448.1891 472.4807 480.8463 508.2233 549.1673 584.9841 600.0509 613.4325 625.0239 631.3189 687.6074 690.8875 709.6465 711.7477 730.8678 763.6204 802.4383 807.9752 832.3411 856.6315 861.6368 913.3284 933.3589 945.8806 966.2154 980.1623 982.9635 986.9589 989.8339 997.0350 1009.7542 1026.1143 1034.5881 1046.8369 1065.7501 1082.0790 1121.6099 1140.7277 1170.7626 1183.6823 1188.7805 1197.5172 1201.9396 1223.9995 1278.9387 1288.1752 1300.8509 1310.2626 1333.3865 1352.7243 1381.6190 1397.5797 1403.0601 1439.8235 1451.5610 1468.6640 1472.7488 1481.7547 1486.1861 1500.6235 1562.9658 1574.4213 1592.7517 1603.2144 1610.9593 1618.2024 1678.9265 2976.4585 2996.1785 3058.0260 3058.9576 3086.6320 3115.3494 3115.6149 3122.8071 3124.1863 3134.4126 3138.9098 3144.7930 3161.4026 3161.8926 3388.9409 3537.6777 3697.0813
redmass: 1.0124 4.8034 4.4694 4.1790 4.3220 4.7758 4.2505 4.7591 5.0220 5.0121 4.5706 5.2732 4.3525 1.8380 3.3691 2.4848 2.8618 2.3562 2.8509 2.8338 3.4770 4.3100 3.1625 1.1774 2.8853 3.1197 2.1899 4.1903 3.8377 3.0572 6.0733 4.2344 5.1411 5.0396 1.8505 3.1999 2.3372 4.8473 3.2804 1.5343 1.2463 1.2432 1.6364 2.3430 2.0791 1.3423 1.3804 1.3803 1.4025 6.0574 1.3234 3.3520 2.2513 2.4598 1.5694 3.2352 1.6902 1.4618 2.8138 1.0640 1.2900 1.1365 1.1174 2.7185 2.9649 3.6599 1.4432 2.4022 1.3364 1.2944 4.8758 7.7826 1.2221 3.1686 2.0437 1.1517 1.1022 1.0555 2.1772 1.8013 2.5798 5.9654 7.4012 5.9931 1.2438 5.6694 6.2089 5.3786 1.0386 1.0590 1.0950 1.1024 1.0999 1.0872 1.0863 1.0866 1.0896 1.0917 1.0966 1.0962 1.0980 1.0986 1.0754 1.0459 1.1035
irintensity: 0.3131 0.3410 7.7848 8.9121 1.9724 0.0791 0.8627 1.8220 8.5847 0.3358 0.2104 1.8634 1.9752 4.5992 3.5305 2.0645 2.0977 78.9695 1.4866 0.0835 4.3800 7.7041 14.4945 195.7591 18.3954 32.3573 39.1512 15.2627 17.1716 28.5093 3.3446 3.8668 4.1640 27.7597 66.0198 9.5754 17.4101 2.6450 7.6243 32.5087 0.3286 0.8874 2.5572 0.3346 1.9377 0.9397 0.0808 0.8236 0.5213 0.4914 0.3799 11.7966 9.1864 9.2479 21.4315 80.9292 24.7698 27.8527 59.8223 1.7357 21.8186 4.8588 6.0377 3.6620 2.1505 150.2229 54.0701 227.8924 9.4823 2.8120 1.2654 0.2918 10.4428 5.5115 13.8549 23.1040 12.6268 9.2691 13.4537 461.9237 24.7007 24.4883 17.7809 4.4761 119.5501 7.7994 7.6755 335.5542 33.6296 20.2793 19.9395 9.6421 16.4584 8.9351 7.5809 0.0798 16.6812 14.7388 15.1704 34.1342 5.5694 26.9692 24.5210 44.8885 44.6104
temp: 298.150 k
press: 1.00000 atm
elementType: 8 7 7 7 6 6 6 6 6 6 6 6 6 6 6 6 6 6 6 6 1 1 1 1 1 1 1 1 1 1 1 1 1 1 1 1 1
symmnumber: 1
zpe: 777857.1 jmol-1
zpe.correction: 0.296270 hartree
zpe.thermalcorrener: 0.314620 hartree
zpe.thermalcorrenthalpy: 0.315564 hartree
zpe.thermalcorrgfe: 0.246239 hartree
zpe.sumelectzpe: -857.945875 hartree
zpe.sumelectthermal: -857.927525 hartree
zpe.sumelectthermalent: -857.926581 hartree
zpe.sumelectthermalfe: -857.995907 hartree
dipole: 2.3219 6.0890 -2.5535
dipole: 6.9992
quadrupole: -95.7600 -129.8888 -113.0851
quadrupole: 2.2625 -4.8407 8.1026
quadrupole: 17.1513 -16.9775 -0.1738 2.2625 -4.8407 8.1026
hfenergy: -858.2421454 hartree
pointgroup: C01 [X(C16H17N3O1)]
dipole: 1.9560553 1.4237498 -1.3151144 debye
polarizability: 220.4680422|-4.096582|240.4731112|11.4155751|-23.9241755|145.8348884 unknown
InChI: InChI=1S/C16H17N3O/c1-12-7-9-14(10-8-12)15(18-19-16(17)20)11-13-5-3-2-4-6-13/h2-10,19H,11,17H2,1H3
charge 0 multiplicity 1
37 atoms
O  -0.025839 -4.604628 1.14303
N  -0.118864 -1.784157 1.058647
N  0.896005 -2.524984 0.474939
N  1.893096 -4.532744 -0.182383
C  -1.250901 0.265116 1.60789
C  -0.053639 -0.463878 1.007047
C  1.089178 0.323167 0.434431
C  -2.234207 0.80809 0.565947
C  2.407185 0.141776 0.943152
C  0.897615 1.278208 -0.600539
C  3.301038 1.842507 -0.601409
C  3.489755 0.890304 0.433783
C  1.987252 2.01789 -1.108084
C  -2.568206 2.184644 0.520812
C  -2.844647 -0.074352 -0.36347
C  -3.493659 2.673405 -0.431071
C  -3.768696 0.410861 -1.314679
C  4.460699 2.66912 -1.127971
C  -4.09624 1.7876 -1.353239
C  0.844094 -3.938505 0.527049
H  -1.771235 -0.465963 2.254088
H  -0.895954 1.093866 2.24814
H  2.575742 -0.564521 1.765266
H  -0.103787 1.432961 -1.013979
H  4.493053 0.739766 0.851079
H  1.813863 2.743785 -1.911923
H  -2.103427 2.875919 1.234964
H  -2.59278 -1.141148 -0.330629
H  -3.74374 3.740424 -0.45115
H  -4.236844 -0.282957 -2.022379
H  4.562344 3.614395 -0.56002
H  5.419509 2.128879 -1.038109
H  4.317114 2.939438 -2.188839
H  -4.814692 2.163451 -2.090482
H  1.664038 -2.049575 -0.020004
H  1.928236 -5.548626 -0.171983
H  2.575043 -4.019032 -0.736823
