program: Gaussian 09
title: 000271710
version: EM64L-G09RevD.01
frameworkgroup: C1[X(C12H16ClN3O)]
method: RPBEPBE
basis: SDD
operation: Freq
keyword: #p
keyword: freq=noraman
keyword: PBEPBE/SDD
title: #p freq=noraman PBEPBE/SDD
converged: YES YES NO NO
title: Mulliken charges:
elementType: Cl O N N N C C C C C C C C C C C C H H H H H H H H H H H H H H H H
charge: -0.062600 -0.246647 0.016498 -0.397061 -0.650094 -0.358721 -0.562462 -0.332628 0.083114 0.346859 -0.690602 -0.379829 -0.358437 -0.239295 -0.225219 -0.102999 0.299187 0.206470 0.226650 0.239935 0.198692 0.199902 0.186518 0.215935 0.211317 0.220341 0.226117 0.299477 0.252131 0.256482 0.273586 0.300805 0.346577
chargesum: 0.00000
title: Mulliken charges with hydrogens summed into heavy atoms:
elementType: Cl O N N N C C C C C C C C C C C C
charge: -0.062600 -0.246647 0.016498 -0.123475 -0.002711 0.074399 -0.123834 0.053792 0.083114 0.346859 -0.043010 -0.153712 -0.058960 0.012836 0.031263 -0.102999 0.299187
polarizability: 2.82387113e+02 -2.05752750e+01 1.79551158e+02 -6.20796230e+00 -1.54051514e+01 9.09907559e+01
1716.lowfreq: -8.3631 -7.2889 -0.6171 -0.0017 -0.0015 -0.0005 17.7980 25.8282 37.0339
frequency: 16.9877 25.8237 37.0091 45.2771 56.4311 63.4228 102.7307 107.7599 136.7403 187.3641 210.5159 228.8337 234.9290 250.3059 266.6405 321.0858 330.8019 363.4909 370.2247 409.2118 417.1238 478.4992 487.4894 498.9711 519.1541 547.8534 613.0012 625.4854 659.3787 668.3014 708.8103 720.8920 731.8259 766.1323 802.1661 817.7703 850.0452 897.2374 918.9636 925.2651 943.3677 991.2863 995.9410 999.2878 1021.8745 1043.7607 1069.2547 1073.3297 1099.0728 1104.0257 1112.5314 1146.7371 1186.1467 1202.7425 1251.2456 1266.6953 1286.7576 1288.8333 1295.2758 1312.1893 1326.0403 1346.6599 1363.3464 1391.7344 1399.0266 1465.8404 1467.8381 1474.8266 1478.5968 1481.2978 1488.2947 1518.5094 1554.0760 1579.5424 1599.5496 1604.8933 1684.2593 2958.2409 2961.2513 2975.9265 2977.0198 3004.1538 3029.2053 3049.9290 3072.9245 3076.8839 3143.5172 3158.1882 3170.6412 3176.8507 3399.6426 3538.0402 3695.4118
redmass: 3.9101 4.2090 3.6473 6.2800 1.5861 7.3623 4.9137 2.7170 4.6875 7.0269 3.3033 3.1907 1.0987 5.6995 2.2838 4.1831 3.2793 3.9550 2.6836 3.0036 4.2740 2.6903 1.6485 1.9488 3.7523 1.4575 4.1504 7.1436 5.0286 4.8312 7.8593 3.6341 1.0870 2.4072 1.5532 1.3963 1.4260 1.8239 1.4451 2.6807 1.3693 4.0436 1.7560 2.0316 2.8004 2.4514 2.6350 2.7924 1.8152 2.0074 1.6328 2.7909 1.1390 1.5564 1.3179 1.2801 1.1313 2.2393 1.2782 1.4656 2.4707 1.5415 5.1941 1.2097 4.2005 1.4952 1.0934 1.3554 1.0418 1.5308 1.1516 1.2551 7.2752 7.4309 5.2360 1.2775 5.4148 1.0678 1.0592 1.0496 1.0489 1.0972 1.0947 1.0995 1.1004 1.0996 1.0879 1.0887 1.0958 1.0974 1.0744 1.0460 1.1035
irintensity: 0.1865 18.3448 1.9890 0.1633 0.1246 4.4854 0.4381 0.0618 1.2739 5.4556 0.0256 1.2139 0.0384 1.0891 5.5936 3.9885 2.1048 31.4936 39.5118 2.1997 23.0373 41.8096 124.2601 80.7331 5.0013 114.2646 8.7166 0.6302 19.8860 18.1935 14.8519 6.5931 2.6799 5.9713 7.2652 22.2300 44.5368 5.1125 0.2796 0.2686 0.0663 51.5471 3.7309 2.3980 3.8625 44.3445 2.1704 48.2898 10.2552 31.6822 35.6492 129.8840 2.8773 10.6787 2.8574 5.3611 43.4653 490.6985 9.5693 8.4502 35.9003 0.4737 4.5472 12.1200 10.7161 352.2162 32.3705 77.5277 12.5111 12.9390 37.0560 61.4269 53.8074 10.5302 78.0049 100.2162 269.3006 19.4110 28.9299 22.1398 56.8319 7.8939 5.7942 38.1237 66.8451 49.9903 14.3997 0.5234 8.2670 2.6909 12.2411 62.1800 48.3592
temp: 298.150 k
press: 1.00000 atm
elementType: 17 8 7 7 7 6 6 6 6 6 6 6 6 6 6 6 6 1 1 1 1 1 1 1 1 1 1 1 1 1 1 1 1
symmnumber: 1
zpe: 692174.1 jmol-1
zpe.correction: 0.263635 hartree
zpe.thermalcorrener: 0.281874 hartree
zpe.thermalcorrenthalpy: 0.282818 hartree
zpe.thermalcorrgfe: 0.213846 hartree
zpe.sumelectzpe: -1165.134337 hartree
zpe.sumelectthermal: -1165.116099 hartree
zpe.sumelectthermalent: -1165.115154 hartree
zpe.sumelectthermalfe: -1165.184126 hartree
dipole: 5.8504 5.0421 -1.7541
dipole: 7.9200
quadrupole: -91.5658 -115.5197 -111.8070
quadrupole: 2.1013 -3.8899 0.0566
quadrupole: 14.7317 -9.2223 -5.5095 2.1013 -3.8899 0.0566
hfenergy: -1165.3979724 hartree
pointgroup: C01 [X(C12H16Cl1N3O1)]
dipole: -2.0993139 2.190146 0.7109266 debye
polarizability: 284.5654523|11.8113836|177.4953464|-11.8470251|13.4157624|90.8682282 unknown
InChI: InChI=1S/C12H16ClN3O/c1-2-3-4-11(15-16-12(14)17)9-5-7-10(13)8-6-9/h5-8,16H,2-4,14H2,1H3
charge 0 multiplicity 1
33 atoms
Cl 5.697692 -0.741878 -0.425402
O  -2.733541 -3.254866 -0.312069
N  -1.07245 -1.052015 0.190855
N  -2.439395 -0.989553 0.321237
N  -4.579852 -1.93345 0.225252
C  -1.249269 2.298578 -0.261913
C  -0.898223 1.353173 0.924104
C  -1.86053 3.638155 0.206915
C  -0.332911 0.013143 0.468545
C  1.131489 -0.15487 0.259515
C  -2.192294 4.583821 -0.967274
C  2.040564 0.927215 0.420172
C  1.658508 -1.424109 -0.12396
C  3.427717 0.756569 0.213717
C  3.037157 -1.609214 -0.331527
C  3.906842 -0.511533 -0.15819
C  -3.211204 -2.151732 0.048924
H  -1.951987 1.790797 -0.953461
H  -0.332249 2.496452 -0.850933
H  -0.176958 1.859489 1.589792
H  -1.804257 1.206411 1.550188
H  -1.154215 4.139597 0.899613
H  -2.780985 3.438556 0.79441
H  -1.2841 4.825847 -1.550034
H  -2.91971 4.119767 -1.659523
H  -2.626496 5.534713 -0.608556
H  1.682844 1.921906 0.704435
H  0.961533 -2.256698 -0.255291
H  4.118409 1.595185 0.339488
H  3.430878 -2.587523 -0.621923
H  -2.910832 -0.127256 0.62591
H  -4.992221 -1.047805 0.511307
H  -5.191254 -2.725669 0.045274
