program: Gaussian 09
title: 000271717
version: EM64L-G09RevD.01
frameworkgroup: C1[X(C16H17N3O2)]
method: RPBEPBE
basis: SDD
operation: Freq
keyword: #p
keyword: freq=noraman
keyword: PBEPBE/SDD
title: #p freq=noraman PBEPBE/SDD
converged: YES YES NO NO
title: Mulliken charges:
elementType: O O N N N C C C C C C C C C C C C C C C C H H H H H H H H H H H H H H H H H
charge: -0.262572 -0.255122 0.052440 -0.413081 -0.651223 -0.633444 0.012905 0.468368 0.285316 -0.391770 -0.373398 -0.431508 -0.384944 -0.360638 -0.364408 0.318821 -0.231176 -0.222421 -0.249217 -0.537546 0.290218 0.254789 0.216531 0.277001 0.263658 0.234891 0.266523 0.255986 0.245533 0.224936 0.226487 0.226977 0.300700 0.222908 0.248424 0.224670 0.342077 0.302308
chargesum: 0.00000
title: Mulliken charges with hydrogens summed into heavy atoms:
elementType: O O N N N C C C C C C C C C C C C C C C C
charge: -0.262572 -0.255122 0.052440 -0.112380 -0.006838 -0.162124 0.012905 0.468368 0.285316 -0.114769 -0.109740 -0.196617 -0.118421 -0.104652 -0.118874 0.318821 -0.006240 0.004066 -0.022240 0.158455 0.290218
polarizability: 2.29917164e+02 1.05611483e+01 2.56615084e+02 -8.33097457e+00 5.14498894e+00 1.42316418e+02
1716.lowfreq: -8.2354 -5.6648 -0.0003 -0.0001 0.0007 4.9163 11.6338 27.7714 34.8538
frequency: 11.0290 27.6942 34.8314 38.9228 44.3858 55.3882 90.0018 110.7358 130.8516 147.6191 186.8352 205.6511 224.1524 237.3910 264.9497 282.8271 300.0373 342.6163 366.5954 404.5425 407.0777 411.4479 452.9396 473.9824 481.1305 484.5618 515.4995 550.7967 586.8468 597.3418 614.6130 625.6165 626.4981 679.5765 692.4333 709.9047 711.6058 734.9854 760.2371 791.0255 808.4018 823.2661 844.4277 859.6544 912.7394 933.1670 943.4055 953.7183 976.7288 981.5518 984.4432 989.5024 997.4920 999.7759 1026.3703 1033.9955 1064.5475 1081.5712 1111.3236 1112.1880 1139.6489 1157.0044 1170.6100 1182.5312 1184.9833 1188.3612 1200.6922 1235.6799 1278.7840 1287.8353 1299.7367 1306.8344 1332.9459 1355.0259 1381.5255 1417.6809 1435.7554 1439.6964 1449.7035 1466.6331 1471.6095 1481.7147 1482.9794 1497.0548 1562.2176 1573.6150 1592.4675 1602.6482 1610.7149 1615.9817 1679.5093 2963.1089 2997.9160 3052.5204 3060.4956 3114.5749 3122.5846 3129.0427 3129.4862 3133.8602 3144.2816 3147.9703 3161.2498 3164.9290 3168.5691 3388.7010 3537.9697 3697.4708
redmass: 4.5618 4.8340 4.3636 4.4421 4.8214 4.3290 3.7807 5.3101 4.4637 5.3615 2.9972 5.6943 1.7282 2.5682 2.8354 1.9762 3.0476 3.3146 2.5176 2.9470 3.1689 3.1585 3.9043 3.1998 1.2199 3.7935 3.1403 3.1118 2.5265 3.9202 3.8464 2.9808 4.3275 4.3241 5.2819 6.6718 1.7343 4.0327 2.4211 4.7843 3.3645 1.3926 1.5093 1.2473 1.6507 2.3355 1.8573 1.5046 1.3386 1.3790 7.8364 6.0679 1.4007 2.7317 2.2431 2.4641 3.1614 1.6683 1.4465 1.2728 2.9261 1.3399 1.0636 1.2786 1.2561 1.1331 2.8617 2.9509 3.7008 1.4273 2.2920 1.3397 1.3032 5.3076 7.7084 3.7399 1.1704 2.0012 1.1645 1.0502 1.0824 2.1872 1.8369 2.3531 7.1343 7.8271 6.0107 1.2392 5.7658 6.1411 5.4171 1.0329 1.0589 1.1041 1.1025 1.0864 1.0866 1.0993 1.0895 1.0917 1.0962 1.0878 1.1015 1.0951 1.0964 1.0753 1.0459 1.1035
irintensity: 0.0817 3.6837 7.0437 2.7689 3.9543 2.4322 8.0647 1.6473 2.6602 2.5663 3.2672 2.3290 0.7849 0.9137 2.4449 7.3347 4.8643 7.5214 72.0108 0.4055 1.9302 2.9650 9.2050 11.3227 188.7684 12.8553 19.6240 33.3204 33.9610 32.3814 14.5343 35.3649 6.3267 7.3566 5.2070 20.2818 69.2786 6.8573 29.5961 2.2156 8.2825 15.0607 41.5083 0.5380 3.8740 0.3811 2.3914 1.3356 0.0817 0.2466 51.2775 0.5605 1.2532 13.6503 9.0892 8.3299 80.1958 21.2978 25.3262 2.4296 76.5498 4.1111 1.5101 86.9095 27.1555 9.6168 3.3168 174.0333 198.6462 37.7590 201.1266 28.5712 4.2970 2.7486 0.3095 25.6993 11.2804 15.6346 21.9576 14.1939 68.1428 18.0612 456.4380 74.0066 41.0387 16.5310 3.8342 126.4649 12.8758 80.6144 336.8502 63.3023 20.1842 44.2034 10.1431 7.2568 0.0865 26.3603 4.0009 14.2548 33.5500 4.5162 27.9919 8.6630 5.4144 23.9490 45.1262 45.1726
temp: 298.150 k
press: 1.00000 atm
elementType: 8 8 7 7 7 6 6 6 6 6 6 6 6 6 6 6 6 6 6 6 6 1 1 1 1 1 1 1 1 1 1 1 1 1 1 1 1 1
symmnumber: 1
zpe: 789836.5 jmol-1
zpe.correction: 0.300833 hartree
zpe.thermalcorrener: 0.320803 hartree
zpe.thermalcorrenthalpy: 0.321747 hartree
zpe.thermalcorrgfe: 0.248823 hartree
zpe.sumelectzpe: -933.068654 hartree
zpe.sumelectthermal: -933.048685 hartree
zpe.sumelectthermalent: -933.047741 hartree
zpe.sumelectthermalfe: -933.120664 hartree
dipole: -5.7226 -3.9172 -2.8763
dipole: 7.5077
quadrupole: -123.9313 -114.9630 -117.4094
quadrupole: -13.1801 1.8223 -5.4771
quadrupole: -5.1634 3.8049 1.3585 -13.1801 1.8223 -5.4771
hfenergy: -933.3694872 hartree
pointgroup: C01 [X(C16H17N3O2)]
dipole: 2.0232978 1.4953698 -1.5474883 debye
polarizability: 228.4334215|8.2146886|251.8441329|4.1425056|-27.6770731|148.5711115 unknown
InChI: InChI=1S/C16H17N3O2/c1-21-14-9-7-13(8-10-14)15(18-19-16(17)20)11-12-5-3-2-4-6-12/h2-10,19H,11,17H2,1H3
charge 0 multiplicity 1
38 atoms
O  4.6216 1.618695 -0.689812
O  -1.123089 -4.678819 0.981569
N  -0.690993 -1.889696 1.035031
N  0.205097 -2.782537 0.469346
N  0.875519 -4.918556 -0.1980
C  -1.482089 0.308434 1.59777
C  -0.396019 -0.599432 1.028611
C  -2.322817 1.018084 0.53156
C  0.889477 -0.006507 0.534757
C  2.137595 -0.460032 1.061305
C  0.914205 1.035292 -0.428379
C  -2.434549 2.430908 0.507999
C  -3.025993 0.260679 -0.441694
C  3.35464 0.100816 0.638675
C  2.130645 1.603813 -0.86707
C  3.35682 1.133903 -0.333635
C  -3.23275 3.077297 -0.46492
C  -3.822773 0.903467 -1.414385
C  -3.928934 2.315114 -1.430701
C  4.681211 2.703093 -1.674978
C  -0.102053 -4.164363 0.45955
H  -2.140638 -0.335809 2.209403
H  -1.022872 1.059157 2.267108
H  2.146451 -1.231771 1.840121
H  -0.026953 1.40292 -0.848727
H  -1.898247 3.026554 1.257474
H  -2.946768 -0.832883 -0.424951
H  4.311107 -0.231871 1.053302
H  2.1081 2.402183 -1.614835
H  -3.312597 4.170559 -0.466778
H  -4.364714 0.305326 -2.155945
H  -4.549842 2.813225 -2.183914
H  1.057995 -2.436672 0.00692
H  4.255204 2.38709 -2.646884
H  5.751878 2.923852 -1.793222
H  4.151488 3.604798 -1.311718
H  0.723796 -5.922999 -0.234815
H  1.704859 -4.526112 -0.639038
