program: Gaussian 09
title: 000271702
version: EM64L-G09RevD.01
frameworkgroup: C1[X(C13H19N3O)]
method: RPBEPBE
basis: SDD
operation: Freq
keyword: #p
keyword: freq=noraman
keyword: PBEPBE/SDD
title: #p freq=noraman PBEPBE/SDD
converged: YES YES NO NO
title: Mulliken charges:
elementType: O N N N C C C C C C C C C C C C C H H H H H H H H H H H H H H H H H H H
charge: -0.252876 0.050722 -0.406856 -0.653053 -0.542603 -0.357640 0.158066 -0.336599 -0.668462 0.492428 -0.692215 -0.443607 -0.389629 -0.223128 -0.221910 -0.248149 0.295734 0.243997 0.201139 0.210115 0.202049 0.187683 0.204553 0.258492 0.201638 0.210408 0.214041 0.219987 0.231201 0.259561 0.224102 0.226044 0.227615 0.276066 0.298107 0.342982
chargesum: 0.00000
title: Mulliken charges with hydrogens summed into heavy atoms:
elementType: O N N N C C C C C C C C C C C C C
charge: -0.252876 0.050722 -0.130790 -0.011964 -0.097467 0.054524 0.158066 0.055637 -0.208332 0.492428 -0.047780 -0.212406 -0.130068 0.000974 0.004134 -0.020534 0.295734
polarizability: 2.10917320e+02 -2.33260625e+01 1.76465462e+02 4.25915519e+00 8.56100475e+00 1.20100623e+02
1716.lowfreq: -12.8082 -4.1836 -0.0005 -0.0004 -0.0002 4.6773 14.2234 22.5284 26.6942
frequency: 11.8784 22.4371 26.5470 36.5917 47.7743 64.0124 105.8434 111.8316 124.4019 137.9051 209.2952 220.4397 233.2140 250.1442 264.2453 323.8689 335.4109 373.1644 399.6781 405.9332 448.1710 475.1489 478.5060 520.5484 565.6964 573.6921 616.7301 626.5310 668.2025 709.2124 710.2860 728.7385 753.1776 787.3863 806.3799 848.1116 858.0344 894.2327 906.7239 921.3156 936.0340 948.2967 980.1757 989.9847 997.1700 1006.8158 1026.1477 1040.6149 1060.2863 1066.5156 1077.1820 1100.4473 1116.2231 1170.9751 1181.1224 1187.2037 1200.3110 1203.8964 1241.7471 1259.9483 1280.8717 1287.7222 1292.5113 1296.1709 1320.8449 1333.1764 1347.0189 1381.9768 1390.0430 1438.9882 1451.2440 1463.8855 1468.4158 1475.7677 1478.0244 1482.2030 1488.1671 1501.0618 1591.0848 1601.1373 1605.4919 1613.4785 1681.9415 2945.6341 2962.8205 2972.7094 2974.8952 2983.1187 3003.4596 3024.1824 3044.8976 3056.2222 3070.8349 3075.0000 3112.1845 3121.1419 3132.6488 3143.4956 3161.0991 3413.8659 3537.6994 3696.4694
redmass: 5.0569 4.2999 3.7797 3.9418 4.1408 1.5404 3.2709 3.5513 3.5024 4.3748 3.1049 1.2439 2.8348 1.5553 3.3514 4.1201 2.3701 2.7380 2.8109 2.8270 3.0999 2.6094 1.2892 1.5001 3.1577 3.2945 6.0894 5.0115 4.0696 1.6998 8.1916 1.0830 2.0929 1.2531 3.3291 3.5231 1.2471 1.7310 1.5947 1.3872 2.5176 1.7936 1.3792 6.0979 1.3262 3.8780 2.2295 2.3896 1.5850 2.5972 1.7179 2.1240 2.3863 1.0610 1.4296 1.1183 1.9245 1.9168 1.4775 1.4310 1.4056 1.0875 1.9486 1.8156 1.4949 1.3672 1.5462 7.9312 1.2126 2.0762 1.1607 1.2813 1.0774 1.0426 1.1253 2.1967 1.1192 1.2766 6.2253 1.5340 3.4476 5.8996 5.4393 1.0675 1.0591 1.0584 1.0393 1.0623 1.0970 1.0967 1.1002 1.0983 1.1006 1.0994 1.0870 1.0863 1.0914 1.0961 1.1015 1.0747 1.0459 1.1034
irintensity: 1.7813 15.5009 1.8586 1.2113 1.2061 0.2924 0.8422 1.1651 3.1168 4.3756 2.3410 0.1443 2.1668 6.5833 1.2972 0.8936 17.9987 42.1226 11.5854 0.2965 14.5990 46.7727 218.8210 31.8497 27.7899 27.6768 0.5088 8.1470 11.6707 59.8577 18.8504 7.7643 32.1119 2.0157 8.0411 5.4220 0.0293 3.7704 2.3648 5.0639 0.8020 1.2872 0.1044 0.6400 0.4613 0.5701 9.8660 21.9819 29.5916 3.8010 6.0682 60.1236 79.7849 1.4035 26.1223 3.0723 21.0823 9.3517 0.4796 15.0265 27.1363 9.2947 274.2614 54.7979 13.3634 9.2473 0.3619 0.5303 12.8754 12.6709 41.2437 146.2747 11.5424 11.6931 52.8122 28.9030 58.3024 146.2811 1.3456 121.5982 23.5798 5.8045 323.9142 17.0985 12.2704 38.2838 52.3562 28.1822 4.1009 4.5391 37.9569 8.5425 76.2481 47.6680 9.3363 0.3775 13.1215 37.4843 27.6731 15.9755 42.5940 42.8215
temp: 298.150 k
press: 1.00000 atm
elementType: 8 7 7 7 6 6 6 6 6 6 6 6 6 6 6 6 6 1 1 1 1 1 1 1 1 1 1 1 1 1 1 1 1 1 1 1
symmnumber: 1
zpe: 790110.4 jmol-1
zpe.correction: 0.300937 hartree
zpe.thermalcorrener: 0.319329 hartree
zpe.thermalcorrenthalpy: 0.320273 hartree
zpe.thermalcorrgfe: 0.250287 hartree
zpe.sumelectzpe: -744.963535 hartree
zpe.sumelectthermal: -744.945143 hartree
zpe.sumelectthermalent: -744.944199 hartree
zpe.sumelectthermalfe: -745.014185 hartree
dipole: 1.3314 5.1630 -3.5373
dipole: 6.3986
quadrupole: -84.8534 -112.8692 -102.4444
quadrupole: 4.2413 -10.1057 10.6726
quadrupole: 15.2023 -12.8135 -2.3888 4.2413 -10.1057 10.6726
hfenergy: -745.2644721 hartree
pointgroup: C01 [X(C13H19N3O1)]
dipole: 0.907708 -1.8153558 1.4892331 debye
polarizability: 200.8724832|27.7347218|187.0770342|-7.6805699|3.8127581|119.533888 unknown
InChI: InChI=1S/C13H19N3O/c1-2-3-9-12(15-16-13(14)17)10-11-7-5-4-6-8-11/h4-8,16H,2-3,9-10,14H2,1H3
charge 0 multiplicity 1
36 atoms
O  2.328212 3.676274 -0.887583
N  1.007494 1.190698 -0.73944
N  2.134202 1.492559 0.014094
N  3.884484 2.90141 0.666805
C  0.857743 -1.06475 0.407561
C  1.964405 -1.984742 -0.18852
C  0.416033 0.026454 -0.557276
C  2.41899 -3.081693 0.800669
C  -0.809054 -0.228064 -1.42355
C  -2.105819 -0.27925 -0.612033
C  3.500324 -4.009095 0.205633
C  -2.916662 -1.441208 -0.589851
C  -2.519106 0.855565 0.134204
C  -4.116787 -1.47213 0.158937
C  -3.716538 0.828522 0.881563
C  -4.520004 -0.336911 0.897818
C  2.744584 2.76207 -0.13342
H  -0.022096 -1.681232 0.66908
H  1.217081 -0.636338 1.368651
H  1.579107 -2.46121 -1.111972
H  2.838953 -1.377601 -0.499712
H  2.805323 -2.605439 1.725665
H  1.539174 -3.68301 1.10677
H  -0.856585 0.582856 -2.172614
H  -0.682503 -1.18337 -1.971081
H  4.402675 -3.436592 -0.080728
H  3.127685 -4.520887 -0.701374
H  3.808303 -4.78599 0.928919
H  -2.61264 -2.323066 -1.16828
H  -1.896358 1.758288 0.120153
H  -4.735046 -2.377275 0.163212
H  -4.026139 1.714361 1.447971
H  -5.45018 -0.357838 1.476874
H  2.499121 0.832412 0.712862
H  4.282352 2.159617 1.239187
H  4.365175 3.795705 0.615109
