program: Gaussian 09
title: 000271703
version: EM64L-G09RevD.01
frameworkgroup: C1[X(C13H18N4O4)]
method: RPBEPBE
basis: SDD
operation: Freq
keyword: #p
keyword: freq=noraman
keyword: PBEPBE/SDD
title: #p freq=noraman PBEPBE/SDD
converged: YES YES NO NO
title: Mulliken charges:
elementType: O O O O N N N N C C C C C C C C C C C C C H H H H H H H H H H H H H H H H H H
charge: -0.188702 -0.272248 -0.213031 -0.207752 -0.020138 -0.431055 0.022901 0.015596 -0.499376 -0.355686 0.188199 -0.335902 -0.523011 -0.693575 -0.662846 0.302116 0.259073 -0.297258 -0.498287 0.445532 -0.368634 0.202165 0.232259 0.189866 0.216737 0.195058 0.201064 0.233480 0.232363 0.210418 0.214433 0.221893 0.223456 0.227731 0.237889 0.367106 0.300630 0.335422 0.292113
chargesum: 0.00000
title: Mulliken charges with hydrogens summed into heavy atoms:
elementType: O O O O N N N N C C C C C C C C C C C C C
charge: -0.188702 -0.272248 -0.213031 -0.207752 -0.020138 -0.063949 0.022901 0.015596 -0.064953 0.050917 0.188199 0.060220 -0.057168 -0.046830 0.026231 0.302116 0.259073 0.003372 -0.162865 0.445532 -0.076521
polarizability: 3.74127334e+02 2.43221770e+01 2.23998033e+02 1.47321286e+01 -1.74796090e+01 1.10974359e+02
1716.lowfreq: -0.0005 -0.0004 0.0007 3.4121 6.6837 10.7388 23.3549 29.1754 43.9252
frequency: 23.1350 28.9867 43.9183 59.3113 62.0315 70.3022 78.1665 91.0112 95.6562 131.8547 150.8957 156.7614 166.2574 183.0170 208.6126 209.7351 233.0534 265.3463 285.7207 305.8665 320.1646 363.1731 367.0939 400.0430 412.5350 442.6066 456.2941 505.9099 515.1140 560.0353 607.8417 645.1544 652.4439 666.8838 687.8790 705.9869 725.2925 731.8914 752.4247 775.2096 789.3490 805.3359 815.7509 850.3881 863.8024 890.3814 895.7677 925.4530 963.8332 976.3919 1000.1482 1012.0313 1023.8979 1039.8005 1051.9548 1064.1732 1070.8662 1099.3532 1104.0662 1127.8615 1135.6418 1166.5340 1208.1029 1211.8457 1227.4684 1232.7780 1254.6184 1268.3386 1276.1975 1291.0298 1299.6418 1312.7375 1321.3542 1340.8410 1345.8960 1360.2181 1386.9044 1391.5315 1398.7867 1449.7111 1453.4030 1467.7042 1469.1523 1476.2706 1476.9291 1477.7655 1483.1325 1487.8546 1502.8246 1517.8740 1575.5478 1584.5256 1624.3626 2966.6910 2970.0345 2975.5692 2977.2925 2983.0963 2992.9501 3010.1442 3036.3857 3051.6677 3065.0824 3073.1892 3076.5864 3092.3559 3094.9733 3179.8295 3189.2894 3201.4085 3241.6913
redmass: 4.5852 4.7180 5.4712 6.4267 3.5594 1.8673 9.2706 3.7330 3.1234 2.4064 5.2063 6.4778 5.5557 1.3519 3.2315 2.2659 1.2357 4.2117 3.1970 7.2131 6.1856 6.4206 4.3632 5.8903 3.8429 3.8998 4.5865 8.5371 3.5809 3.8094 5.6818 6.0938 7.9302 6.7197 5.1781 7.8451 4.8362 1.0994 11.8730 1.9763 1.2586 1.7093 1.2405 3.0817 1.4205 6.0471 1.8595 1.3262 1.4048 2.1895 4.4325 1.3134 3.3454 1.8635 2.0773 1.6783 2.2650 3.8617 2.1330 1.8045 1.3593 8.5389 1.6291 3.6908 1.5738 1.8929 1.2825 1.5795 1.2247 1.0843 1.8954 1.5637 1.6490 3.9900 1.5577 7.0287 3.8119 1.2171 1.2451 4.8896 1.1353 1.1564 1.6389 1.0517 1.0659 1.0418 1.1663 1.0868 1.5537 2.4736 5.1425 6.4287 7.3669 1.0584 1.0627 1.0372 1.0613 1.0653 1.0351 1.0978 1.1009 1.0963 1.0996 1.1009 1.0993 1.1011 1.1002 1.0896 1.0920 1.0960 1.0785
irintensity: 0.2642 1.0859 0.2072 0.0686 0.4781 0.1271 0.9693 1.5150 0.2508 0.4012 0.3117 2.0574 3.7181 1.0662 0.3347 2.2374 0.0366 7.2078 0.6824 0.9668 1.9506 3.7345 0.9346 2.2726 2.2742 0.1527 2.6890 5.0905 13.3039 20.3316 2.0168 4.6966 16.2741 4.3499 4.1704 7.8145 1.2331 7.5916 11.4338 2.3404 11.2078 4.7800 80.0230 3.6129 23.3353 2.6781 5.1813 0.1085 23.9628 9.9977 2.4408 0.0681 53.7350 3.4252 42.7527 19.4600 1.9359 65.5258 24.1307 14.1026 45.1049 365.6028 33.7005 402.5352 3.8075 147.3081 1.8703 13.2715 2.1093 3.7045 92.0450 16.2512 19.1721 225.0485 5.2683 62.3759 26.5761 13.1268 17.8860 1.7347 8.8835 0.5950 16.0694 7.6899 3.6302 13.0386 7.6705 18.8829 80.9402 88.7383 33.3487 152.0671 448.2193 13.0470 6.0247 33.5999 68.5677 26.2272 26.1841 2.9195 15.8914 12.8810 5.9682 94.5814 50.7949 33.6929 39.5068 3.1813 20.0140 0.0262 64.6734
temp: 298.150 k
press: 1.00000 atm
elementType: 8 8 8 8 7 7 7 7 6 6 6 6 6 6 6 6 6 6 6 6 6 1 1 1 1 1 1 1 1 1 1 1 1 1 1 1 1 1 1
symmnumber: 1
zpe: 802514.7 jmol-1
zpe.correction: 0.305662 hartree
zpe.thermalcorrener: 0.327079 hartree
zpe.thermalcorrenthalpy: 0.328024 hartree
zpe.thermalcorrgfe: 0.252943 hartree
zpe.sumelectzpe: -1024.324551 hartree
zpe.sumelectthermal: -1024.303133 hartree
zpe.sumelectthermalent: -1024.302189 hartree
zpe.sumelectthermalfe: -1024.377270 hartree
dipole: 9.7242 -0.1618 1.1281
dipole: 9.7908
quadrupole: -147.6695 -137.1653 -124.2957
quadrupole: -2.8569 -0.8168 4.1519
quadrupole: -11.2927 -0.7885 12.0812 -2.8569 -0.8168 4.1519
hfenergy: -1024.6302128 hartree
pointgroup: C01 [X(C13H18N4O4)]
dipole: 3.8299028 -0.1974885 0.3613761 debye
polarizability: 376.4232199|18.0201984|219.1261938|6.0164144|-26.1124287|113.5503118 unknown
InChI: InChI=1S/C13H18N4O4/c1-3-5-6-10(4-2)14-15-12-8-7-11(16(18)19)9-13(12)17(20)21/h7-9,15H,3-6H2,1-2H3
charge 0 multiplicity 1
39 atoms
O  -2.829863 3.010942 -0.993505
O  -0.571995 2.856805 -0.734133
O  -4.937702 -2.663845 0.667818
O  -5.774989 -0.663272 -0.054859
N  1.573625 -0.196525 0.43046
N  0.500092 0.625178 0.067864
N  -1.781521 2.334117 -0.678591
N  -4.794706 -1.436288 0.281066
C  3.929014 -0.580805 0.738941
C  4.759802 -1.062154 -0.485695
C  2.784042 0.331633 0.35502
C  5.951927 -1.954208 -0.068326
C  3.100005 1.763753 -0.058306
C  6.778438 -2.441735 -1.277297
C  2.886367 2.771994 1.109159
C  -0.781219 0.133087 0.116513
C  -1.922243 0.947282 -0.24421
C  -1.034083 -1.217259 0.53326
C  -3.234816 0.428543 -0.189589
C  -3.426555 -0.89407 0.222813
C  -2.327594 -1.725312 0.587057
H  4.604931 -0.042846 1.435783
H  3.524348 -1.458861 1.273378
H  5.141246 -0.189866 -1.05481
H  4.096809 -1.624222 -1.172231
H  6.605252 -1.389003 0.627235
H  5.57213 -2.827419 0.499366
H  4.153274 1.812386 -0.38549
H  2.491694 2.076871 -0.930816
H  7.195196 -1.588453 -1.844971
H  6.154237 -3.034067 -1.972303
H  7.622933 -3.078357 -0.956659
H  3.521058 2.513551 1.975317
H  1.836563 2.790119 1.450927
H  3.15104 3.792358 0.781988
H  0.586524 1.611873 -0.247321
H  -0.16917 -1.824696 0.804792
H  -4.083312 1.059258 -0.466625
H  -2.52478 -2.752791 0.90368
