program: Gaussian 09
title: 000271675
version: EM64L-G09RevD.01
frameworkgroup: C1[X(C5H7N3O3)]
method: RPBEPBE
basis: SDD
operation: Freq
keyword: #pfreq=noraman
keyword: PBEPBE/SDD
title: #p freq=noraman PBEPBE/SDD
converged: NO YES NO NO
title: Mulliken charges:
elementType: O O O N N N C C C C C H H H H H H H
charge: -0.195279 -0.209152 -0.233944 -0.190169 -0.380005 -0.538230 -0.340969 0.251555 0.167331 0.228802 -0.593313 0.292130 0.366127 0.257285 0.268223 0.256650 0.308140 0.284818
chargesum: 0.00000
title: Mulliken charges with hydrogens summed into heavy atoms:
elementType: O O O N N N C C C C C
charge: -0.195279 -0.209152 -0.233944 -0.190169 -0.013877 0.054728 -0.048839 0.251555 0.167331 0.228802 0.188845
polarizability: 1.00906216e+02 3.98632475e+00 9.46541830e+01 -3.47835282e+00 -1.97361674e+00 5.47062294e+01
1716.lowfreq: -0.0011 -0.0011 -0.0005 0.3359 8.8357 12.0077 56.3812 83.1418 101.8680
frequency: 56.3307 83.1356 101.8578 151.1919 205.3802 211.1869 243.1263 300.2088 323.7431 360.6572 372.9487 435.8280 483.2141 514.9556 587.5850 611.8487 676.7266 706.9818 736.0475 753.8799 784.0276 913.2395 940.9042 1043.9240 1107.3986 1129.8144 1153.1561 1176.1311 1227.2353 1275.2772 1312.8510 1346.3172 1351.8645 1374.5662 1432.1062 1470.9907 1484.8428 1610.0388 1640.5572 1649.0845 1662.2934 3018.9027 3090.4244 3112.5551 3151.2169 3482.7996 3512.8865 3620.7125
redmass: 5.0028 3.4233 1.1507 10.0490 1.1353 4.4977 3.0231 5.0051 3.2738 9.5589 7.5294 8.9531 3.9249 1.7020 10.0121 4.3140 2.9012 8.0125 5.8770 3.0735 2.1054 3.5506 2.5366 2.5614 4.3133 1.3138 1.8084 3.0704 2.8138 1.5969 4.3868 4.1737 1.3599 1.8177 1.2343 1.0592 1.0712 7.1187 1.1744 5.4242 8.7115 1.0340 1.0854 1.1014 1.1028 1.0447 1.0768 1.1003
irintensity: 2.0259 1.7541 0.3991 14.8953 48.4783 4.2276 4.0896 5.9065 3.3914 17.9425 33.3527 11.2366 34.1239 213.3407 3.5757 8.5887 12.9783 2.5253 2.4630 19.0370 105.1072 6.8108 6.9777 54.1946 20.1984 2.0039 9.9125 105.1928 56.8266 12.6236 224.9459 214.6965 12.3252 11.7956 98.3652 17.4553 16.6616 381.6232 90.4570 468.1010 40.6560 18.0931 1.4781 13.0955 0.3207 12.1506 57.8157 14.1122
temp: 298.150 k
press: 1.00000 atm
elementType: 8 8 8 7 7 7 6 6 6 6 6 1 1 1 1 1 1 1
symmnumber: 1
zpe: 346874.9 jmol-1
zpe.correction: 0.132118 hartree
zpe.thermalcorrener: 0.142861 hartree
zpe.thermalcorrenthalpy: 0.143806 hartree
zpe.thermalcorrgfe: 0.095561 hartree
zpe.sumelectzpe: -583.860282 hartree
zpe.sumelectthermal: -583.849538 hartree
zpe.sumelectthermalent: -583.848594 hartree
zpe.sumelectthermalfe: -583.896839 hartree
dipole: -0.0819 -0.4085 1.4694
dipole: 1.5273
quadrupole: -66.2423 -75.7836 -60.5756
quadrupole: 0.6296 4.9071 1.7366
quadrupole: 1.2915 -8.2498 6.9582 0.6296 4.9071 1.7366
hfenergy: -583.9923999 hartree
pointgroup: C01 [X(C5H7N3O3)]
dipole: -0.0131338 0.107642 -0.591038 debye
dipolederiv: -0.505517 -0.158145 0.0700077 0.0384967 -0.9791557 0.2633614 0.0014878 0.251926 -0.4002905 -1.0417536 -0.2125003 -0.2661204 -0.2531629 -0.6205327 -0.1356506 -0.2056111 -0.0562583 -0.3963169 -0.8998695 0.3013332 -0.1569719 0.2647293 -0.897214 0.170731 -0.1651873 0.1653204 -0.4282556 -0.7369397 0.2818284 -0.1073323 -0.0101236 -1.4268066 0.3188323 -0.107659 0.3216756 -0.2875739 -1.5605316 -0.1044771 -0.1876614 0.22644 -0.4711796 0.0238532 -0.3243134 0.0239144 -0.3700359 -0.3816439 -0.0775141 0.1019311 -0.0072019 -0.7448208 -0.1875647 0.1221104 -0.1754994 -0.3901414 0.0965661 -0.0488843 -0.1069122 -0.0317061 0.1370231 0.06816 -0.0952364 0.0472927 0.3341271 0.8640403 -0.3689842 0.080448 -0.2881144 1.2913148 -0.4852734 0.0288035 -0.5073537 0.3454334 1.5289341 0.0489525 0.4552189 -0.2662501 0.8168454 0.0471505 0.5266948 0.0727774 0.2643783 1.6568091 0.0663528 0.2113235 0.2188259 1.784271 -0.2854319 0.2958865 -0.3202416 0.4263474 0.3561571 0.1335297 -0.0271824 0.0937267 0.1082633 0.022336 -0.0150715 0.0728834 0.1805438 0.0411897 0.0230878 -0.051307 0.0104332 0.0559528 0.027589 -0.0275589 0.0205932 0.0213532 0.1457149 0.0173545 -0.0460265 0.01517 0.2184532 0.0106663 -0.0821965 0.0269547 0.334202 0.0622923 0.0240769 0.0310838 -0.0587197 -0.0162316 -0.0997227 0.0037631 -0.0689739 0.0497186 0.0839505 0.0153365 -0.0144142 0.1177111 0.0767851 0.0644458 -0.0440161 0.0371013 0.1000032 0.0229428 -0.0314684 0.0141615 -0.0537978 0.0889418 0.0193035 0.0868458 0.0212784 -0.0703255 0.0947437 -0.0066789 -0.0064266 -0.1090064 0.3519527 0.0284593 0.0159531 -0.0058333 0.1486133 0.1729146 0.0968 0.0061803 0.09255 0.226138 0.128755 -0.0146949 0.0724426 0.1382192 unknown
polarizability: 101.0174959|-2.6515026|93.3649431|6.6696954|-5.0199497|55.8841895 unknown
InChI: InChI=1S/C5H7N3O3/c1-8-4(10)2(6)3(9)7-5(8)11/h2,7H,6H2,1H3
charge 0 multiplicity 1
18 atoms
O  -0.544891 -2.321253 0.800985
O  2.568147 1.304799 0.685347
O  -1.853408 1.943014 -0.598997
N  -1.208443 -0.242674 -0.007046
N  0.366257 1.566228 -0.021054
N  1.762675 -1.240061 -1.030555
C  1.243754 -0.733886 0.253623
C  -0.222057 -1.175665 0.404492
C  1.467621 0.783934 0.371975
C  -0.960243 1.132857 -0.245082
C  -2.613243 -0.716982 -0.078059
H  1.8086 -1.222619 1.062689
H  0.504946 2.579089 -0.105398
H  -2.649893 -1.650712 -0.659986
H  -3.215517 0.067703 -0.556557
H  -2.997815 -0.922106 0.934863
H  2.776683 -1.365614 -1.057245
H  1.376526 -0.80505 -1.872695
