program: Gaussian 09
title: 000271715
version: EM64L-G09RevD.01
frameworkgroup: C1[X(C20H15ClN4O4)]
method: RPBEPBE
basis: SDD
operation: Freq
keyword: #p
keyword: freq=noraman
keyword: PBEPBE/SDD
title: #p freq=noraman PBEPBE/SDD
converged: YES YES NO NO
title: Mulliken charges:
elementType: Cl O O O O N N N N C C C C C C C C C C C C C C C C C C C C H H H H H H H H H H H H H H H
charge: -0.037162 -0.185954 -0.266741 -0.210032 -0.204736 -0.042638 -0.420748 0.024068 0.016135 -0.733742 0.109314 0.488605 0.335114 0.308929 -0.420602 -0.372534 -0.358554 -0.353251 0.258362 -0.287278 -0.497735 0.448204 -0.223942 -0.227797 -0.369182 -0.238793 -0.213680 -0.245346 -0.109951 0.253504 0.258685 0.245132 0.240034 0.243687 0.267698 0.378939 0.291312 0.335907 0.237238 0.230213 0.293277 0.260838 0.260717 0.234489
chargesum: 0.00000
title: Mulliken charges with hydrogens summed into heavy atoms:
elementType: Cl O O O O N N N N C C C C C C C C C C C C C C C C C C C C
charge: -0.037162 -0.185954 -0.266741 -0.210032 -0.204736 -0.042638 -0.041809 0.024068 0.016135 -0.221553 0.109314 0.488605 0.335114 0.308929 -0.175470 -0.132500 -0.114867 -0.085553 0.258362 0.004033 -0.161828 0.448204 0.013296 0.002416 -0.075905 0.022045 0.047037 -0.010857 -0.109951
polarizability: 5.69189710e+02 1.44199460e+01 3.27472900e+02 -4.40249316e+00 -2.90784073e+01 1.60987465e+02
1716.lowfreq: -4.2484 -0.0015 -0.0005 0.0005 1.3052 7.3202 16.3122 23.5798 28.9063
frequency: 16.3073 23.5540 28.8891 33.9742 41.6335 50.8059 55.9502 66.6131 79.4322 96.1168 128.2085 144.3402 147.5929 163.7962 176.9897 191.0474 229.4501 240.0990 280.3107 304.4949 311.2094 353.9402 357.6988 372.4561 381.7381 402.0825 405.0311 409.5863 439.6275 447.8186 476.6701 490.6262 496.2790 513.3655 525.3441 529.7403 604.7315 616.8897 619.7426 626.1428 650.3647 661.1777 673.7363 694.4470 703.7012 706.0228 718.1306 724.4857 743.3835 754.1843 776.8898 798.4403 811.9980 826.4607 843.1599 849.6119 852.4357 859.4005 889.9778 909.9199 951.8621 954.7781 963.1784 977.3193 979.6517 990.5699 993.8588 999.7487 1008.5836 1014.1418 1028.6487 1048.4773 1076.2269 1084.8924 1091.8881 1101.2424 1117.8415 1136.8945 1166.7260 1171.0220 1176.9927 1189.3014 1192.7040 1200.5027 1211.3462 1231.9077 1276.9590 1296.1028 1299.8052 1310.0212 1336.1142 1342.4594 1359.6468 1363.0874 1380.9122 1389.0932 1401.4941 1441.4624 1447.2846 1470.3624 1478.8005 1482.3032 1496.4863 1519.0819 1522.9077 1572.4039 1582.6396 1592.7685 1597.3846 1612.6027 1621.4781 2982.4750 3047.2734 3124.4554 3127.4462 3139.5864 3147.7445 3150.2604 3161.5934 3167.3256 3173.7617 3180.2920 3181.2836 3189.0755 3202.4982 3233.5581
redmass: 7.3930 6.1287 7.1537 8.4337 5.2392 4.1536 10.5218 9.3154 10.3780 7.8633 7.7133 8.2534 9.3556 5.6441 6.0982 9.6203 6.9337 6.7300 5.0865 8.4676 7.6649 4.7264 7.8952 5.4698 7.1439 3.8612 3.1958 3.1885 3.9533 4.0391 3.3721 7.2685 5.7250 3.6729 4.9892 3.8107 4.8242 6.5595 6.2926 7.1869 7.7009 6.3560 6.8974 6.7899 1.9706 7.5294 3.9099 4.6458 1.7640 11.5882 4.5474 1.6450 1.6920 1.4131 2.1981 2.5368 1.2508 1.4516 5.5274 1.5409 1.7027 1.8426 1.4118 1.3937 1.3784 5.9440 4.0128 1.3661 1.3247 2.9975 2.2783 2.1871 2.7518 2.1502 2.4848 4.0809 1.3768 1.3416 2.9861 1.5686 1.1433 1.1364 1.4977 1.6679 5.4719 1.8178 1.5334 1.3100 2.1223 3.0171 1.2945 4.6256 5.5235 6.2089 7.7176 4.6477 4.2611 2.1847 5.8794 2.1385 2.4701 2.2439 1.7640 2.3521 6.1964 7.1562 4.6978 5.9705 6.1213 5.9699 7.3709 1.0666 1.0932 1.0856 1.0881 1.0917 1.0888 1.0957 1.0886 1.1015 1.0960 1.0898 1.0971 1.0919 1.0957 1.0788
irintensity: 0.0788 0.8816 0.6893 0.4501 0.2176 0.2742 0.0100 1.0270 0.7609 0.1099 1.2065 1.2107 0.5807 3.6946 4.3202 1.8980 4.5210 0.4628 0.3427 1.4314 0.0228 3.6855 11.6644 7.9346 10.1696 1.5608 0.3440 0.7295 1.9690 1.6612 6.9868 8.0461 2.8621 19.2579 16.9578 12.2736 9.3304 11.0815 3.8291 5.2051 15.5569 3.4809 10.8729 9.2239 43.0319 8.5606 1.8452 1.0068 66.8328 7.2587 3.9383 96.4841 11.5471 8.7431 26.1071 30.4071 5.1739 31.2894 3.5026 9.0773 7.4919 10.1467 23.8963 0.7128 3.3626 1.4544 54.9859 1.2764 0.1987 1.7001 8.7039 9.2640 109.4582 59.1626 16.0708 60.5183 9.8342 64.7264 253.7580 101.6235 18.5499 6.4270 16.4576 1.9065 567.6662 155.0672 1.8541 7.5291 58.5452 66.2264 3.4680 323.9276 32.8041 11.7263 1.0423 59.9839 14.1889 6.6707 1.2236 79.3450 28.2730 44.1708 147.8433 45.6430 22.5299 9.9438 136.5923 1.6227 97.1516 15.4147 482.5115 14.9694 12.1785 5.1098 1.2488 14.7814 10.9362 20.1973 0.9306 19.2383 5.9436 3.4723 2.8465 21.8147 0.0869 69.4734
temp: 298.150 k
press: 1.00000 atm
elementType: 17 8 8 8 8 7 7 7 7 6 6 6 6 6 6 6 6 6 6 6 6 6 6 6 6 6 6 6 6 1 1 1 1 1 1 1 1 1 1 1 1 1 1 1
symmnumber: 1
zpe: 830153.6 jmol-1
zpe.correction: 0.316189 hartree
zpe.thermalcorrener: 0.340917 hartree
zpe.thermalcorrenthalpy: 0.341861 hartree
zpe.thermalcorrgfe: 0.257685 hartree
zpe.sumelectzpe: -1748.888212 hartree
zpe.sumelectthermal: -1748.863484 hartree
zpe.sumelectthermalent: -1748.862539 hartree
zpe.sumelectthermalfe: -1748.946716 hartree
dipole: -6.9785 1.9077 -0.2007
dipole: 7.2374
quadrupole: -225.3796 -176.5138 -172.5924
quadrupole: 3.7673 -1.4602 7.7738
quadrupole: -33.8843 14.9815 18.9029 3.7673 -1.4602 7.7738
hfenergy: -1749.2044006 hartree
pointgroup: C01 [X(C20H15Cl1N4O4)]
dipole: 2.7866484 0.5809417 -0.0695902 debye
polarizability: 565.0357932|-27.3731659|329.857049|-24.6897621|31.617596|162.7572323 unknown
InChI: InChI=1S/C20H15ClN4O4/c21-16-8-6-15(7-9-16)19(12-14-4-2-1-3-5-14)23-22-18-11-10-17(24(26)27)13-20(18)25(28)29/h1-11,13,22H,12H2
charge 0 multiplicity 1
44 atoms
Cl 6.804872 -3.440604 -0.526082
O  -4.116253 2.04645 1.561403
O  -1.839668 2.093996 1.504117
O  -5.580303 -3.546257 -0.87883
O  -6.643925 -1.690841 -0.071141
N  0.646415 -0.661282 0.326068
N  -0.509327 0.050206 0.586834
N  -2.989862 1.494362 1.275447
N  -5.576999 -2.356257 -0.369497
C  1.917274 1.37331 1.089549
C  1.808126 -0.05793 0.567064
C  1.640391 2.456113 0.035117
C  3.024267 -0.866725 0.303497
C  -1.740194 -0.5289 0.363096
C  0.85385 3.588104 0.366881
C  2.195636 2.364545 -1.267779
C  4.314876 -0.269128 0.230655
C  2.925512 -2.276856 0.109873
C  -2.971517 0.159525 0.67977
C  -1.840341 -1.843788 -0.199177
C  -4.225782 -0.442688 0.43776
C  -4.268371 -1.726517 -0.115969
C  0.636695 4.61472 -0.579527
C  1.977694 3.390318 -2.213827
C  -3.0767 -2.436316 -0.437725
C  5.466016 -1.043789 -0.024079
C  4.064203 -3.061558 -0.142613
C  1.200303 4.521147 -1.872139
C  5.32602 -2.432168 -0.206284
H  1.21844 1.509514 1.939778
H  2.921522 1.523675 1.521758
H  0.403516 3.668901 1.363382
H  2.788786 1.487319 -1.551552
H  4.440224 0.811155 0.355251
H  1.940205 -2.746459 0.168929
H  -0.537698 1.026553 0.944078
H  -0.908419 -2.357043 -0.440981
H  -5.145538 0.093047 0.685754
H  0.021396 5.479475 -0.308607
H  2.411625 3.306133 -3.216514
H  -3.156946 -3.436616 -0.870997
H  6.451807 -0.574214 -0.082929
H  3.978817 -4.143019 -0.281288
H  1.029453 5.315486 -2.606927
