program: Gaussian 09
title: 000271701
version: EM64L-G09RevD.01
frameworkgroup: C1[X(C24H19NO2)]
method: RPBEPBE
basis: SDD
operation: Freq
keyword: #p
keyword: freq=noraman
keyword: PBEPBE/SDD
title: #p freq=noraman PBEPBE/SDD
converged: YES YES NO NO
title: Mulliken charges:
elementType: O O N C C C C C C C C C C C C C C C C C C C C C C C C H H H H H H H H H H H H H H H H H H H
charge: -0.281769 -0.254276 -0.004042 -0.277468 0.019605 0.527964 0.225989 0.420355 -0.461991 -0.373169 -0.357851 -0.353953 0.439162 -0.414928 -0.418962 -0.353864 -0.385926 -0.267630 -0.229145 0.220607 -0.808584 0.212296 -0.345129 -0.335756 -0.224359 -0.219892 -0.224485 0.247197 0.225798 0.270964 0.228288 0.233763 0.237273 0.230426 0.228527 0.240861 0.230725 0.232150 0.229962 0.224135 0.233337 0.268448 0.274901 0.231077 0.229463 0.229905
chargesum: 0.00000
title: Mulliken charges with hydrogens summed into heavy atoms:
elementType: O O N C C C C C C C C C C C C C C C C C C C C C C C C
charge: -0.281769 -0.254276 -0.004042 -0.030271 0.019605 0.527964 0.225989 0.420355 -0.236193 -0.102205 -0.129563 -0.120190 0.439162 -0.177656 -0.188537 -0.125336 -0.145065 -0.036904 0.003006 0.220607 -0.121150 0.212296 -0.076681 -0.060855 0.006718 0.009571 0.005420
polarizability: 3.15532890e+02 -5.91823784e+00 2.81894739e+02 -3.89977146e+01 9.47198864e+00 2.26806395e+02
1716.lowfreq: -6.7614 -0.0005 0.0002 0.0006 3.9597 10.0489 10.5409 15.6657 27.4672
frequency: 8.3831 14.1199 27.2725 28.6077 34.4140 36.6975 52.5817 66.5993 102.3316 130.2790 138.8043 160.0185 172.1807 181.9400 226.2604 244.1040 268.9599 297.0167 322.1300 351.5122 391.3662 404.0621 406.9848 408.3798 431.6588 444.0190 468.4529 479.3872 498.5306 502.5783 524.4115 566.6218 583.3064 613.9593 631.9912 650.1517 661.4877 672.3082 678.8828 701.5997 727.6908 746.0600 760.0620 774.5268 786.6347 795.7344 802.8032 804.5147 833.9163 843.2963 856.1426 859.5116 865.0636 883.7992 891.5996 917.7139 954.4050 957.1234 960.2761 973.4639 983.6658 988.0567 990.6670 996.1029 996.6349 1007.3719 1011.3847 1015.7851 1019.6065 1032.7096 1047.6436 1051.7889 1072.7015 1085.9736 1122.1224 1150.6390 1172.9547 1179.4288 1182.0667 1190.2677 1200.6362 1221.1990 1226.7705 1238.9042 1245.7181 1262.3213 1282.4665 1311.1373 1315.8969 1323.3258 1359.4453 1375.5273 1381.3248 1389.4099 1398.2209 1407.6731 1410.0418 1423.0226 1437.4651 1443.1198 1470.7540 1474.9614 1477.9139 1502.1147 1508.3472 1557.4721 1579.0054 1583.5427 1587.2506 1611.1090 1618.4072 1624.5944 1629.3470 2976.6929 3029.5447 3055.4906 3084.5465 3110.2533 3119.7158 3126.4191 3127.9602 3132.1292 3136.4602 3138.7942 3141.5007 3150.7985 3154.1969 3155.6150 3157.2146 3166.5007 3170.4090 3181.0763
redmass: 1.4200 2.5401 4.7024 4.5189 4.6021 3.8007 4.6030 6.9514 4.5439 5.0801 4.6740 5.2614 5.0104 5.3695 4.7587 5.9379 5.0204 8.0636 4.8213 2.8723 5.0382 2.8327 2.9233 3.2619 4.9742 3.9564 3.7246 4.3809 5.5753 4.9372 5.6222 4.0979 3.6423 6.4370 6.7508 6.5603 6.5567 4.6372 5.1585 1.6042 3.4099 1.7874 2.3581 4.1160 6.4148 2.2498 2.7348 5.1575 1.7930 1.3259 1.2873 3.6309 1.2446 2.4542 3.0169 6.0658 1.4235 1.4053 1.4011 1.4185 1.3767 1.4208 6.1860 1.3846 1.3518 1.3259 5.0388 2.9529 3.1675 2.2339 1.5636 2.9033 2.3242 1.7127 1.3299 1.3880 1.0578 1.1205 1.1304 1.1860 1.5713 2.9909 2.0860 3.0660 1.7402 2.0638 2.1595 1.5864 1.3170 1.5305 2.4006 2.7681 4.0799 9.9721 1.2713 2.4007 2.5236 4.8994 2.2448 2.0947 1.0492 1.1058 2.2722 3.0589 2.7269 7.1007 6.1058 6.9328 6.1833 6.3344 9.6211 6.3740 6.4899 1.0374 1.0839 1.0971 1.0990 1.0876 1.0888 1.0862 1.0854 1.0869 1.0960 1.0894 1.0893 1.0962 1.0942 1.0954 1.0985 1.0984 1.0989 1.0969
irintensity: 0.7779 0.6319 0.7091 0.5110 0.1083 0.3097 1.0566 0.5628 0.5569 0.1714 0.7899 0.0974 0.0579 1.7722 0.3475 6.2068 2.2881 12.0881 0.7347 2.6575 1.3073 0.0328 0.7950 2.3309 1.9249 0.9157 1.3355 0.8748 7.3384 24.4713 5.2285 15.4949 18.2431 0.6557 0.5017 1.1107 8.8833 7.1925 16.3632 83.3875 2.4047 21.1745 19.8985 34.2009 2.6163 17.4911 12.2109 5.7094 25.6448 45.5173 3.7932 27.3044 0.0663 29.3957 12.2629 62.1238 3.0702 0.4538 1.0600 2.3491 0.1904 2.8848 0.9649 0.1728 0.1924 0.3118 11.9785 17.0432 119.3289 6.1648 16.8644 261.7374 0.3553 30.5280 12.3612 3.8676 0.6217 2.7992 59.5527 10.6329 3.6207 7.3620 12.2080 319.0821 5.6351 46.9525 31.8550 6.6217 2.7831 7.5477 34.2485 1.1445 2.6707 2.8753 9.3441 2.1875 3.2484 5.6359 17.3320 1.1883 12.0014 13.3982 7.0008 15.6667 26.8553 20.1234 8.8390 47.9137 1.6964 16.1133 153.5823 8.9897 2.1472 39.1114 6.8907 20.3614 18.8858 14.5300 18.4763 1.4354 0.3636 2.3979 23.2751 7.8397 12.6382 2.6157 20.8745 26.5772 51.8618 25.8453 17.4582 7.2231
temp: 298.150 k
press: 1.00000 atm
elementType: 8 8 7 6 6 6 6 6 6 6 6 6 6 6 6 6 6 6 6 6 6 6 6 6 6 6 6 1 1 1 1 1 1 1 1 1 1 1 1 1 1 1 1 1 1 1
symmnumber: 1
zpe: 945468.7 jmol-1
zpe.correction: 0.360110 hartree
zpe.thermalcorrener: 0.382836 hartree
zpe.thermalcorrenthalpy: 0.383780 hartree
zpe.thermalcorrgfe: 0.302686 hartree
zpe.sumelectzpe: -1129.318170 hartree
zpe.sumelectthermal: -1129.295444 hartree
zpe.sumelectthermalent: -1129.294500 hartree
zpe.sumelectthermalfe: -1129.375593 hartree
dipole: 2.2203 0.8868 0.7073
dipole: 2.4932
quadrupole: -131.3126 -140.8900 -147.5623
quadrupole: -4.4968 -6.0848 -2.8772
quadrupole: 8.6090 -0.9684 -7.6406 -4.4968 -6.0848 -2.8772
hfenergy: -1129.6782796 hartree
pointgroup: C01 [X(C24H19N1O2)]
dipole: -0.8715079 0.3599757 -0.2703137 debye
polarizability: 315.3175708|6.0691298|282.010196|-39.3660616|-8.4707746|226.9062562 unknown
InChI: InChI=1S/C24H19NO2/c1-17-11-13-19(14-12-17)23(27-24(26)20-8-3-2-4-9-20)22-21-10-6-5-7-18(21)15-16-25-22/h2-16,23H,1H3
charge 0 multiplicity 1
46 atoms
O  1.23574 0.479643 0.324226
O  1.66123 -1.504549 1.47404
N  -0.145405 -1.059475 -1.466733
C  -0.218821 0.281034 0.590803
C  -0.778562 -0.839258 -0.29916
C  -0.882049 1.628546 0.350826
C  -1.951531 -1.5811 0.112955
C  -2.432535 -2.61944 -0.775837
C  -1.410095 2.370672 1.431581
C  -0.961894 2.169021 -0.957551
C  -2.660428 -1.344034 1.336762
C  -1.728949 -2.84012 -2.004189
C  -2.101975 4.176975 -0.092155
C  -3.586097 -3.385598 -0.407892
C  -2.015653 3.628696 1.21141
C  -1.559668 3.426255 -1.170782
C  -0.620493 -2.051504 -2.303869
C  -3.783926 -2.104302 1.670131
C  -4.250217 -3.134142 0.793653
C  2.078916 -0.532274 0.794987
C  -2.759259 5.524121 -0.338581
C  3.500263 -0.292521 0.413987
C  4.481483 -1.201235 0.888516
C  3.882874 0.802474 -0.403511
C  5.83737 -1.014208 0.550948
C  5.241168 0.985086 -0.738491
C  6.219641 0.079808 -0.26241
H  -0.315208 -0.020659 1.649647
H  -1.338035 1.973178 2.452181
H  -0.545208 1.598479 -1.794748
H  -2.32837 -0.55639 2.019153
H  -2.063159 -3.619111 -2.697924
H  -3.939047 -4.171126 -1.086348
H  -2.419618 4.192532 2.06073
H  -1.610492 3.836371 -2.187224
H  -0.058957 -2.186246 -3.234296
H  -4.31452 -1.913904 2.609287
H  -5.131565 -3.72274 1.071051
H  -2.096574 6.195956 -0.914952
H  -3.014255 6.030186 0.608365
H  -3.693511 5.412237 -0.92135
H  4.159369 -2.040776 1.513541
H  3.113562 1.48944 -0.766186
H  6.59424 -1.716093 0.917639
H  5.538243 1.829358 -1.370194
H  7.273779 0.224743 -0.525137
