program: Gaussian 09
title: 000271672
version: EM64L-G09RevD.01
frameworkgroup: C1[X(C17H23NO4)]
method: RPBEPBE
basis: SDD
operation: Freq
keyword: #p
keyword: freq=noraman
keyword: PBEPBE/SDD
title: #p freq=noraman PBEPBE/SDD
converged: YES YES NO NO
title: Mulliken charges:
elementType: O O O O N C C C C C C C C C C C C C C C C C H H H H H H H H H H H H H H H H H H H H H H H
charge: -0.278086 -0.265656 -0.232400 -0.226729 -0.176979 0.169615 -0.540105 -0.505110 -0.428797 -0.426124 0.238637 0.188163 0.452519 -0.363240 -0.377198 -0.262731 -0.258019 -0.234225 -0.227003 -0.272916 -0.661675 -0.665390 0.226586 0.264402 0.254667 0.251401 0.213732 0.269923 0.225598 0.218468 0.242938 0.211892 0.234517 0.221915 0.235778 0.226437 0.216869 0.215972 0.223674 0.258791 0.224697 0.215908 0.248602 0.229676 0.221007
chargesum: 0.00000
title: Mulliken charges with hydrogens summed into heavy atoms:
elementType: O O O O N C C C C C C C C C C C C C C C C C
charge: -0.278086 -0.265656 -0.232400 -0.226729 -0.176979 0.169615 -0.049117 0.000958 0.054858 0.017942 0.238637 0.188163 0.452519 -0.120302 -0.165306 0.193700 0.204195 -0.017357 -0.011031 -0.049242 0.037720 0.033896
polarizability: 2.72231197e+02 1.90888344e+01 1.63255832e+02 -5.89198397e+00 6.97772125e+00 1.78313532e+02
1716.lowfreq: -11.6880 -6.2300 -0.0009 -0.0006 -0.0006 2.3931 8.6990 26.7014 35.3225
frequency: -11.5582 26.4683 35.3034 37.0432 49.8737 57.9761 61.0270 81.4242 94.9475 115.2790 130.7571 161.4056 175.9707 204.1323 219.6403 229.5503 249.3312 258.5021 295.9785 316.4508 318.7197 329.4570 351.0582 386.9303 409.3958 415.1648 433.6647 442.3619 463.9733 507.2202 516.5344 544.8165 614.8511 632.1081 652.6014 688.2002 707.6636 718.2307 724.1803 745.9359 751.8030 792.5812 803.3909 809.7843 817.4695 819.5888 837.4806 863.3942 885.1756 926.8679 946.4021 952.9299 969.4197 973.4447 975.3608 991.7285 1012.7002 1021.7674 1023.9491 1033.9023 1066.5777 1088.6882 1090.9907 1096.1776 1100.1663 1131.4337 1143.4063 1156.5370 1157.1167 1170.4259 1176.6171 1188.0661 1199.9975 1217.6925 1241.7958 1250.0870 1276.1008 1278.4159 1283.0939 1321.1361 1330.6397 1339.1549 1347.0166 1354.1504 1354.5644 1363.5387 1380.9429 1391.1333 1392.6374 1393.2679 1448.1383 1456.9080 1457.7914 1462.5369 1462.9870 1470.4671 1476.2683 1483.9601 1484.9388 1485.2355 1497.0980 1502.2478 1575.7426 1620.6028 1620.9474 1639.5969 2901.3251 2931.1491 2993.1932 2993.6609 3011.0148 3018.6415 3029.9019 3032.2993 3045.7007 3083.8594 3086.3273 3087.7110 3088.9819 3094.2184 3095.2088 3101.4300 3119.0342 3119.6344 3121.7206 3126.2159 3146.4892 3158.5467 3170.1802
redmass: 4.6735 4.2459 3.4109 4.2149 3.7778 3.0902 3.7765 3.7616 5.3010 4.5975 4.4343 2.4067 2.8351 1.4391 1.9303 1.8754 5.1604 2.3067 2.2908 2.4519 2.6714 3.5262 3.4864 4.7210 3.4560 5.7025 3.4205 3.6325 3.5044 2.8027 3.1175 5.2099 6.2510 3.2627 7.0640 1.8075 5.6852 4.6183 2.4026 3.1726 1.8845 1.8361 1.4615 2.1468 1.6184 1.7598 1.7689 1.5230 2.2510 3.2938 2.4290 1.3944 1.8747 1.5495 5.3207 2.9467 2.8461 2.0164 3.5196 2.0036 2.3364 2.3640 1.8663 2.1572 2.5827 3.5035 3.1465 1.6886 1.6752 1.1145 3.1702 3.0619 1.1433 1.2610 1.5521 1.3485 1.1204 1.1272 1.4980 1.3052 1.4247 1.4083 1.4098 1.2909 1.2730 1.3988 3.4008 1.2372 1.7129 1.4600 2.5826 1.0949 1.0912 1.0445 1.0466 1.0904 1.0814 1.0591 1.0548 1.1162 1.1597 2.2430 5.9083 6.2422 9.3374 9.8939 1.0710 1.0737 1.0363 1.0360 1.0632 1.0618 1.0594 1.0598 1.0890 1.1008 1.0975 1.0975 1.0973 1.1032 1.1028 1.0925 1.0843 1.1060 1.1065 1.0883 1.0923 1.0951 1.0980
irintensity: 0.7993 0.7828 0.0404 2.2888 0.7507 0.6324 0.3928 0.1358 0.2555 2.7821 1.2973 2.4401 1.3977 2.3787 0.8820 0.7558 1.2444 6.8626 4.8925 5.7581 16.7272 14.2546 10.9261 6.2203 1.3399 5.2986 3.1497 3.2802 3.3972 15.0877 2.6639 4.3195 0.2804 2.9121 10.0347 44.1919 6.6154 2.1526 13.0739 1.9302 78.1727 14.0197 1.7255 2.6361 3.2885 7.8951 3.3813 8.8651 1.4187 22.9575 16.2150 0.5777 8.5544 2.4026 13.9292 2.8029 62.3076 38.7486 92.1406 2.8046 19.1484 88.5547 45.7954 56.0492 76.3241 8.6630 394.1946 23.1015 7.6227 11.4701 163.3414 19.8713 5.2078 12.4005 102.0170 20.2112 4.6041 3.6907 9.1459 5.2513 1.2015 11.5015 32.4171 4.4951 0.8926 2.3448 24.9160 30.0097 2.8442 43.3704 0.0372 22.8503 9.3505 15.4455 12.4404 21.8093 20.9083 19.6586 24.4762 37.7698 41.1698 125.9902 11.9589 165.9276 318.9645 21.2662 77.2835 81.0258 18.5503 14.9679 26.9702 12.4374 26.8943 33.5126 7.7032 13.5948 10.8243 31.0613 38.5646 1.5975 1.2026 14.8783 9.9408 28.1271 27.5766 10.3605 40.7518 38.6283 5.9098
temp: 298.150 k
press: 1.00000 atm
elementType: 8 8 8 8 7 6 6 6 6 6 6 6 6 6 6 6 6 6 6 6 6 6 1 1 1 1 1 1 1 1 1 1 1 1 1 1 1 1 1 1 1 1 1 1 1
symmnumber: 1
zpe: 978525.9 jmol-1
zpe.correction: 0.372701 hartree
zpe.thermalcorrener: 0.394200 hartree
zpe.thermalcorrenthalpy: 0.395144 hartree
zpe.thermalcorrgfe: 0.320756 hartree
zpe.sumelectzpe: -1015.583562 hartree
zpe.sumelectthermal: -1015.562063 hartree
zpe.sumelectthermalent: -1015.561118 hartree
zpe.sumelectthermalfe: -1015.635506 hartree
dipole: -2.7474 0.7074 -0.1061
dipole: 2.8390
quadrupole: -123.3622 -121.4765 -132.7095
quadrupole: 0.8622 7.8065 5.8354
quadrupole: 2.4872 4.3728 -6.8601 0.8622 7.8065 5.8354
hfenergy: -1015.9562626 hartree
pointgroup: C01 [X(C17H23N1O4)]
dipole: 1.0983833 -0.1877103 0.076716 debye
polarizability: 238.5413338|-54.4509498|194.5820839|2.8554351|-7.0383934|180.6771427 unknown
InChI: InChI=1S/C17H23NO4/c1-3-21-15(19)17(16(20)22-4-2)10-12-18(13-11-17)14-8-6-5-7-9-14/h5-9H,3-4,10-13H2,1-2H3
charge 0 multiplicity 1
45 atoms
O  2.153016 1.200766 -0.811668
O  3.464346 -1.302037 0.709424
O  1.32394 1.04057 1.358171
O  2.831234 -2.605664 -1.112528
N  -1.510503 -0.439038 -0.110848
C  1.239414 -0.938966 -0.160348
C  0.403372 -1.615805 0.971666
C  0.45883 -1.026196 -1.515932
C  -0.962217 -0.909309 1.175662
C  -1.057071 -1.218227 -1.276259
C  1.548961 0.520149 0.243423
C  2.577573 -1.705926 -0.281377
C  -2.606171 0.442403 -0.137919
C  -3.264396 0.82481 1.073927
C  -3.087865 1.014252 -1.358288
C  2.506384 2.634274 -0.564739
C  4.784062 -2.008888 0.768762
C  -4.341128 1.735249 1.057907
C  -4.170868 1.914697 -1.358482
C  -4.812102 2.289161 -0.153679
C  1.307037 3.541599 -0.851738
C  4.669713 -3.299584 1.583513
H  0.259256 -2.677823 0.698773
H  0.959549 -1.582573 1.923551
H  0.648005 -0.109376 -2.096851
H  0.856905 -1.87954 -2.09435
H  -1.659261 -1.614716 1.685425
H  -0.813798 -0.038291 1.836776
H  -1.619248 -0.925798 -2.174902
H  -1.278943 -2.295494 -1.10984
H  -2.945325 0.403296 2.031077
H  -2.602727 0.77942 -2.311149
H  2.846451 2.732986 0.48107
H  3.342845 2.815734 -1.258434
H  5.118154 -2.209452 -0.264235
H  5.445695 -1.270757 1.248781
H  -4.821733 2.004361 2.006128
H  -4.510043 2.335965 -2.312528
H  -5.65219 2.991168 -0.160992
H  0.480287 3.334872 -0.151958
H  0.94266 3.400963 -1.884021
H  1.604406 4.600063 -0.731632
H  4.01469 -4.028009 1.076919
H  4.269845 -3.094045 2.591418
H  5.670164 -3.756944 1.696323
