program: Gaussian 09
title: 000271679
version: EM64L-G09RevD.01
frameworkgroup: C1[X(C17H22N2O9S)]
method: RPBEPBE
basis: SDD
operation: Freq
keyword: #p
keyword: freq=noraman
keyword: PBEPBE/SDD
title: #p freq=noraman PBEPBE/SDD
converged: YES YES NO NO
title: Mulliken charges:
elementType: S O O O O O O O O O N N C C C C C C C C C C C C C C C C C H H H H H H H H H H H H H H H H H H H H H H
charge: 0.923953 -0.525431 -0.526713 -0.265618 -0.244771 -0.218592 -0.240278 -0.251623 -0.410415 -0.241136 -0.549757 -0.459456 -0.320525 -0.036771 -0.183622 -0.246826 0.504141 -0.339762 -0.436068 0.332405 0.250803 -0.564607 0.229697 -0.469499 -0.263782 -0.258865 -0.664924 -0.660266 0.193703 0.338584 0.348068 0.279509 0.294167 0.318990 0.236199 0.315754 0.284853 0.233583 0.297819 0.261613 0.226603 0.239490 0.239180 0.230258 0.253296 0.238479 0.219855 0.220445 0.254429 0.232523 0.380908
chargesum: 0.00000
title: Mulliken charges with hydrogens summed into heavy atoms:
elementType: S O O O O O O O O O N N C C C C C C C C C C C C C C C C C
charge: 0.923953 -0.525431 -0.526713 -0.265618 -0.244771 -0.218592 -0.240278 -0.251623 -0.029507 -0.241136 -0.201689 -0.143702 0.018059 -0.036771 0.095887 0.047342 0.504141 -0.020772 -0.199869 0.332405 0.250803 -0.046171 0.229697 0.089932 0.202311 0.210572 0.046706 0.047131 0.193703
polarizability: 3.90971387e+02 -1.62090142e+01 2.33719238e+02 4.68399878e+00 2.42783135e+01 1.85727820e+02
1716.lowfreq: -7.3503 -2.8116 -0.9243 -0.0013 -0.0004 -0.0003 5.2104 11.3505 17.4062
frequency: 3.8120 11.1048 17.3410 23.7929 30.5450 31.3569 39.3555 44.5285 51.0826 59.0388 68.2506 73.1133 81.9318 87.0911 89.9417 95.3602 120.2163 128.4782 135.6959 157.3924 166.7345 189.3029 191.5159 201.1977 210.2897 238.2610 259.6686 267.5589 278.6745 291.7409 310.2239 319.6581 327.7287 341.2227 364.8243 384.8567 391.9336 411.6481 429.3104 440.8148 443.1825 468.6622 509.6976 516.7532 528.3001 558.5792 578.3186 593.4958 614.7696 631.7931 648.0310 659.4375 664.7455 708.4409 712.0135 724.9088 728.6610 776.0127 789.3811 798.8938 808.0720 813.8789 817.0516 830.5284 834.3439 838.0347 859.6228 883.1340 897.6720 936.7085 942.4774 961.8550 968.4382 988.7189 992.8128 1004.8004 1015.2054 1016.0741 1050.3470 1056.9422 1081.2937 1095.6430 1096.2450 1097.5215 1123.8339 1126.1304 1150.1398 1156.7921 1159.0615 1178.4138 1184.0194 1188.1551 1239.5352 1249.4470 1256.5541 1267.6544 1275.0066 1275.4412 1279.4791 1300.2124 1328.6787 1350.0735 1352.9301 1365.6925 1370.0040 1382.7903 1393.9496 1394.0934 1406.0829 1442.1797 1451.2088 1457.7503 1458.8411 1462.6522 1464.2382 1478.0854 1483.8373 1484.9449 1505.0025 1597.0291 1601.0975 1630.6140 1635.6438 1646.4359 1662.5610 2945.1767 2984.7459 2994.9636 2995.7588 3000.9545 3032.4705 3036.9347 3039.1822 3075.0964 3089.7301 3091.2817 3096.4044 3099.8345 3122.3231 3126.7501 3127.4788 3163.5812 3165.8344 3197.2666 3298.9839 3514.5306 3520.6000
redmass: 4.7196 6.2227 5.5489 6.5924 5.7563 5.0255 4.1582 5.9720 3.9053 3.1971 4.5069 3.3874 6.6845 4.0341 6.0068 4.4684 5.0520 4.4785 4.8801 8.5089 6.0271 6.3115 1.9615 2.6266 1.9162 2.1396 8.2324 5.0699 2.4155 4.9434 4.4241 6.3946 5.1319 5.7522 6.6376 5.2584 5.8070 2.9722 6.7913 4.5902 3.9847 4.2177 2.2328 3.2088 3.2387 3.2065 7.2498 4.0366 6.0716 3.9137 1.5754 1.2266 3.6420 5.6486 5.0072 4.6502 3.3792 2.0182 2.4096 5.1642 1.6132 1.6405 1.9636 3.6508 3.0898 1.3857 1.5243 4.4893 5.2421 4.7024 4.8444 4.1574 1.3771 5.1568 1.3588 2.5949 3.1060 2.1528 3.1446 2.3857 4.1252 2.2133 2.4396 2.1611 1.6474 2.1517 1.3995 1.6690 1.6669 1.8790 1.7614 1.7432 1.3255 1.2556 1.6160 1.6053 1.1370 1.1231 1.4887 1.4118 1.6565 1.2332 1.2764 1.4285 2.9278 2.5270 1.2275 1.2308 4.7227 1.0732 1.1004 1.0881 1.0934 1.0476 1.0451 2.3063 1.0524 1.0528 2.2740 6.5998 5.9244 4.7770 9.1630 9.2884 8.0589 1.0806 1.0605 1.0362 1.0363 1.0642 1.0599 1.0600 1.0990 1.0963 1.0975 1.0972 1.1029 1.1029 1.1062 1.1070 1.0903 1.0917 1.0951 1.0953 1.0735 1.0640 1.0764
irintensity: 0.8903 0.0738 1.5242 0.7854 1.1939 2.0589 0.7617 0.8657 2.6345 0.4913 0.2186 4.0351 2.2243 3.7313 0.5472 1.0294 4.3386 2.8906 1.1735 2.0567 14.0303 1.6690 2.4978 4.2026 15.1621 0.0312 3.3223 3.7702 2.9004 12.9429 24.4883 5.9420 43.9249 10.3141 10.7013 14.2443 3.6260 0.2460 17.6866 18.6305 2.7592 93.6379 33.2196 44.1124 75.0702 84.8419 24.1511 2.6514 1.7914 31.3129 110.9345 46.6350 13.6405 5.9747 4.8475 8.5642 0.2047 52.8772 10.5185 89.2300 61.0041 57.8335 5.8823 8.2362 41.7835 19.9074 80.0131 2.2079 55.3315 20.1800 15.9169 30.6129 1.1127 0.4745 1.8940 23.6624 171.2413 49.4210 250.2589 18.1792 37.7772 47.4998 74.7929 31.0792 124.0587 158.6873 27.0724 11.3989 1.9012 96.6756 171.5267 67.4471 58.0389 99.6771 96.5674 4.0730 9.0553 6.5952 77.9611 23.3443 63.3943 2.3735 1.2312 12.6822 306.4740 15.0725 17.7855 23.0911 17.8362 9.0065 56.7841 16.6684 14.2522 11.2922 13.9332 43.9659 11.7276 15.1309 523.5956 123.7257 15.7179 92.9527 145.1472 195.1027 192.0521 43.9597 13.1746 14.2051 16.1807 37.2103 28.7948 25.1373 11.5652 7.0641 32.0241 33.8280 0.6929 1.4651 24.5679 26.6773 13.0640 1.3435 10.6090 8.1943 106.2423 30.7131 16.6405
temp: 298.150 k
press: 1.00000 atm
elementType: 16 8 8 8 8 8 8 8 8 8 7 7 6 6 6 6 6 6 6 6 6 6 6 6 6 6 6 6 6 1 1 1 1 1 1 1 1 1 1 1 1 1 1 1 1 1 1 1 1 1 1
symmnumber: 1
zpe: 1003931.7 jmol-1
zpe.correction: 0.382377 hartree
zpe.thermalcorrener: 0.414405 hartree
zpe.thermalcorrenthalpy: 0.415350 hartree
zpe.thermalcorrgfe: 0.310555 hartree
zpe.sumelectzpe: -1843.249680 hartree
zpe.sumelectthermal: -1843.217652 hartree
zpe.sumelectthermalent: -1843.216708 hartree
zpe.sumelectthermalfe: -1843.321502 hartree
dipole: -4.6638 1.3765 -0.1604
dipole: 4.8653
quadrupole: -138.2401 -178.1019 -190.0597
quadrupole: 23.2363 5.9799 9.7634
quadrupole: 30.5605 -9.3014 -21.2591 23.2363 5.9799 9.7634
hfenergy: -1843.6320573 hartree
pointgroup: C01 [X(C17H22N2O9S1)]
dipole: 1.8841465 0.2600163 0.2154847 debye
polarizability: 392.0075827|-5.4540317|241.279487|9.3834792|-10.7120355|177.1313748 unknown
InChI: InChI=1S/C17H22N2O9S/c1-3-27-16(23)15(17(24)28-4-2)19-29(25,26)12-7-5-11(6-8-12)18-13(20)9-10-14(21)22/h5-8,15,18-19,21H,3-4,9-10H2,1-2H3
charge 0 multiplicity 1
51 atoms
S  -2.286132 -1.290506 -0.759616
O  -2.59692 -0.531204 -2.173362
O  -2.843895 -2.783794 -0.429091
O  -1.705993 2.612289 0.015578
O  -5.680141 2.136455 -0.231428
O  -3.29667 2.952073 1.694207
O  -5.620393 0.178445 1.042774
O  4.488067 0.641935 -0.5896
O  9.578149 0.243973 -0.531782
O  8.719856 -0.53598 1.479201
N  -2.889683 -0.120485 0.605622
N  3.728159 -1.474247 0.087373
C  -3.54809 1.086611 0.06786
C  -0.431626 -1.304774 -0.492963
C  0.319466 -0.177211 -0.85891
C  0.13574 -2.467757 0.051041
C  2.327176 -1.369748 -0.122973
C  1.716052 -0.206798 -0.67216
C  1.530506 -2.494287 0.231859
C  -2.876928 2.321182 0.702196
C  -5.057139 1.06471 0.359958
C  6.124831 -0.970238 0.287632
C  4.720769 -0.512802 -0.127032
C  7.213457 -0.175466 -0.452248
C  -0.861249 3.718373 0.581793
C  -7.159846 2.273453 -0.004844
C  0.028705 3.196219 1.711471
C  -7.937574 1.432193 -1.01852
C  8.533816 -0.198239 0.288225
H  -3.396162 1.128024 -1.033295
H  -3.554746 -0.685823 1.178737
H  -0.16805 0.707763 -1.279344
H  -0.496762 -3.322817 0.30898
H  2.33793 0.647337 -0.943834
H  2.001084 -3.391397 0.652309
H  4.049726 -2.369602 0.464586
H  6.243693 -0.802042 1.376924
H  6.25358 -2.057252 0.12561
H  6.883041 0.877949 -0.549771
H  7.368516 -0.536826 -1.483427
H  -0.279118 4.063082 -0.287262
H  -1.535149 4.519679 0.932248
H  -7.377248 1.969122 1.033558
H  -7.333812 3.35313 -0.131491
H  -0.579899 2.85769 2.566323
H  0.658069 2.358038 1.366344
H  0.694064 4.007393 2.060822
H  -9.021085 1.613509 -0.892572
H  -7.748856 0.356632 -0.866138
H  -7.660695 1.702598 -2.051798
H  10.426109 0.255932 -0.009671
