program: Gaussian 09
title: 000271643
version: EM64L-G09RevD.01
frameworkgroup: C1[X(C10H5ClO4)]
method: RPBEPBE
basis: SDD
operation: Freq
keyword: #p
keyword: freq=noraman
keyword: PBEPBE/SDD
title: #p freq=noraman PBEPBE/SDD
converged: NO NO NO NO
title: Mulliken charges:
elementType: Cl O O O O C C C C C C C C C C H H H H H
charge: -0.033241 -0.253947 -0.136119 -0.383230 -0.257145 0.394772 0.173070 -0.319788 0.063987 -0.333311 -0.322074 0.094788 -0.142300 -0.177174 0.129256 0.295977 0.273388 0.276528 0.267679 0.388885
chargesum: 0.00000
title: Mulliken charges with hydrogens summed into heavy atoms:
elementType: Cl O O O O C C C C C C C C C C
charge: -0.033241 -0.253947 -0.136119 0.005655 -0.257145 0.394772 0.173070 -0.023812 0.063987 -0.059923 -0.045547 0.094788 -0.142300 0.090505 0.129256
polarizability: 2.47134047e+02 1.94723297e+00 1.33141909e+02 -2.83943525e-03 5.66463260e-03 4.83454429e+01
1716.lowfreq: -5.0302 -4.8445 0.0010 0.0018 0.0021 6.0861 29.3627 55.9537 79.6767
frequency: 29.3301 55.9515 79.6652 130.1898 152.0944 222.0872 242.6287 289.1659 313.8128 335.3749 368.4535 376.1831 389.6345 456.1342 494.0969 544.9545 556.4705 566.7113 606.6797 647.5107 667.8785 679.3927 723.8858 738.0713 764.8032 806.1872 829.1831 844.3105 879.3725 905.5010 959.8624 988.1747 1042.4625 1069.6600 1123.5773 1127.9751 1212.5273 1240.4686 1261.7044 1325.9471 1359.5424 1402.0108 1411.5817 1464.2679 1546.7599 1589.4692 1602.5868 1625.1207 1717.1668 3139.2789 3163.6558 3166.6399 3186.5492 3506.5003
redmass: 9.4576 10.0458 6.7304 11.9549 10.1668 9.4096 5.5720 12.6708 11.0087 6.7923 6.7216 10.3267 3.9393 3.1369 9.6728 8.2307 3.3497 6.1200 1.5237 8.0552 6.1827 3.4953 7.4290 3.9114 7.9561 7.7362 1.4671 6.8102 1.4261 6.3522 1.3434 1.4574 3.5352 2.1873 1.9098 1.5334 2.7690 1.8461 1.5805 2.3856 2.9530 8.8871 4.9390 3.2081 7.1193 7.6170 8.0035 7.9431 12.9049 1.0924 1.0935 1.0895 1.0976 1.0640
irintensity: 3.5406 0.9250 0.6159 0.1225 0.8998 3.9747 0.6842 0.1687 0.6552 1.6331 0.8905 11.7977 0.7843 5.0576 0.0160 19.1579 25.7353 110.3632 99.6159 37.9729 18.7468 43.2854 13.5720 0.3097 30.0455 67.1367 55.0952 3.6738 8.4329 4.1635 0.1508 19.9280 185.2765 96.6722 225.8060 44.5056 13.9151 92.4063 6.1043 32.6884 26.2682 9.7919 12.3636 50.1607 205.4229 116.4611 149.4231 89.8051 523.9918 0.3522 0.2974 0.0943 0.5640 55.6846
temp: 298.150 k
press: 1.00000 atm
elementType: 17 8 8 8 8 6 6 6 6 6 6 6 6 6 6 1 1 1 1 1
symmnumber: 1
zpe: 334530.9 jmol-1
zpe.correction: 0.127416 hartree
zpe.thermalcorrener: 0.139759 hartree
zpe.thermalcorrenthalpy: 0.140703 hartree
zpe.thermalcorrgfe: 0.087185 hartree
zpe.sumelectzpe: -1143.984119 hartree
zpe.sumelectthermal: -1143.971777 hartree
zpe.sumelectthermalent: -1143.970832 hartree
zpe.sumelectthermalfe: -1144.024350 hartree
dipole: -2.4342 -0.9876 0.0016
dipole: 2.6269
quadrupole: -91.6022 -97.5427 -92.3864
quadrupole: -12.8532 0.0041 -0.0051
quadrupole: 2.2415 -3.6989 1.4574 -12.8532 0.0041 -0.0051
hfenergy: -1144.1115355 hartree
pointgroup: C01 [X(C10H5Cl1O4)]
dipole: 0.9230711 0.4645815 0.0141132 debye
dipolederiv: -0.7094105 -0.2704507 -0.01058 -0.4061922 -0.2746247 -0.0056783 -0.0086448 -0.002704 -0.0507262 -1.3056032 -0.4798659 -0.0171944 0.0374389 -0.3801734 0.0033286 -0.0249192 -0.0081665 -0.2107145 -0.9645637 -0.3701609 -0.0094883 -0.6747513 -0.7719008 -0.0079578 -0.005168 -0.0013107 -0.2933842 -1.272643 -0.3592172 -0.0134343 -0.4293012 -0.356673 -0.0097475 -0.0124431 -0.0083569 -0.3910809 -0.7934727 0.2000033 -0.0130443 0.3236304 -1.0053638 0.0173341 -0.0148806 0.0149283 -0.3321872 -0.6901274 0.163271 -0.0175022 0.3512812 -0.1890017 0.0104305 -0.0202281 0.0063291 -0.004814 0.630748 0.4152301 0.004641 0.0567756 0.3085082 -0.0012211 0.0098995 0.0066171 0.1392995 1.131875 -0.0943743 0.0265558 0.02639 0.1241038 -0.0013852 0.0247688 -0.0039928 -0.0125605 -1.1926015 0.1462074 -0.0275228 -0.3836687 -0.4222417 -0.002821 -0.0195999 0.0087772 -0.0403109 0.1342411 -0.2337568 0.0081621 0.0218005 -0.0068211 -0.0006287 0.0043903 -0.0062612 -0.0810736 -0.2063843 -0.1772314 0.0015316 -0.0830276 0.084534 -0.005383 0.0001896 -0.007401 -0.1561449 1.6991906 0.5935146 0.0224895 0.658731 1.0534552 0.0036354 0.0219219 0.0022427 0.3000879 0.845534 0.5782764 0.012001 0.9673661 0.2133 0.0170504 0.0063612 0.0084894 -0.0805086 -0.2152935 -0.0662128 -0.0021778 -0.3115029 0.0845813 -0.0092166 0.0014416 -0.0038241 -0.072971 2.2270369 -0.1655666 0.0453271 -0.3605852 1.2693701 -0.0237409 0.0481598 -0.0194895 0.2459822 0.1454109 -0.018644 0.0004551 -0.000457 0.0292071 0.001547 0.0002043 0.0011354 0.1376118 0.0957682 0.0299664 -0.0019358 -0.0072055 -0.0021953 0.0022792 -0.0014057 0.0030769 0.1635773 0.0838012 -0.0211701 -0.0017506 0.0096664 -0.0050028 0.0028928 -0.0021963 0.0022087 0.1775329 -0.0014004 0.0514829 -0.0043602 0.0318179 0.0885865 0.0017767 -0.0040954 0.0022183 0.1615242 0.3578944 0.0786985 -0.0021723 0.1717936 0.1583521 0.0075057 -0.0037559 0.0054837 0.4008607 unknown
polarizability: 245.9880923|11.1238462|134.1806119|4.1869365|-1.0217231|48.4526944 unknown
InChI: InChI=1S/C10H5ClO4/c11-6-1-2-8-5(3-6)4-7(9(12)13)10(14)15-8/h1-4,12H
charge 0 multiplicity 1
20 atoms
Cl 4.737952 1.519867 0.045008
O  -0.273875 -1.783712 -0.016767
O  -2.557906 -2.061866 -0.063615
O  -4.120228 0.218339 -0.129807
O  -3.044086 2.270769 -0.138286
C  0.773128 0.430453 -0.026561
C  0.865474 -0.995185 -0.003432
C  -0.538571 1.013729 -0.063823
C  -1.699167 0.25075 -0.078097
C  1.970499 1.205246 -0.011621
C  2.119713 -1.645022 0.033711
C  -1.652878 -1.222616 -0.05559
C  3.202261 0.546578 0.025269
C  3.293137 -0.869875 0.04815
C  -2.984134 1.013747 -0.117211
H  -0.656276 2.104098 -0.082185
H  1.915118 2.297895 -0.028879
H  2.15999 -2.737179 0.050614
H  4.273764 -1.353547 0.076955
H  -4.922413 0.809032 -0.156631
