program: Gaussian 09
title: 000271662
version: EM64L-G09RevD.01
frameworkgroup: C1[X(C17H25NO2S)]
method: RPBEPBE
basis: SDD
operation: Freq
keyword: #p
keyword: freq=noraman
keyword: PBEPBE/SDD
title: #p freq=noraman PBEPBE/SDD
converged: YES YES NO NO
title: Mulliken charges:
elementType: S O O N C C C C C C C C C C C C C C C C C H H H H H H H H H H H H H H H H H H H H H H H H H
charge: 0.131768 -0.192049 -0.249829 -0.587267 -0.371035 -0.564571 -0.394310 -0.359267 0.521188 -0.345269 0.223294 -0.700352 -0.351802 0.250099 -0.396934 -0.392494 -0.764226 -0.696327 -0.247746 -0.234664 -0.241473 0.299089 0.233493 0.266690 0.221356 0.214860 0.226155 0.195500 0.234935 0.216824 0.223754 0.193497 0.193303 0.250555 0.257322 0.236642 0.254058 0.252664 0.215101 0.214745 0.212790 0.229625 0.228123 0.231444 0.324386 0.336356
chargesum: 0.00000
title: Mulliken charges with hydrogens summed into heavy atoms:
elementType: S O O N C C C C C C C C C C C C C C C C C
charge: 0.131768 -0.192049 -0.249829 0.073475 -0.371035 -0.265482 0.105873 0.076950 0.521188 0.076386 0.223294 -0.024840 0.034998 0.250099 -0.146380 -0.135172 -0.020863 -0.053691 -0.018121 -0.006541 -0.010028
polarizability: 2.80902724e+02 8.26043404e+00 1.99179901e+02 5.82236154e+00 1.29346019e+01 1.66221011e+02
1716.lowfreq: -12.2533 -6.3803 -0.0021 -0.0017 -0.0017 4.6930 15.2455 23.9918 41.0640
frequency: 4.1621 23.7505 40.6734 44.6897 48.9988 62.6838 71.7110 81.9198 87.8120 98.0692 107.6158 114.1199 137.6692 147.6092 169.7649 182.7699 203.0779 212.5734 224.9655 232.6189 254.6375 255.6265 296.7219 341.3445 350.3432 362.0903 387.0686 405.2344 408.8365 443.6794 458.7818 508.0603 524.3034 557.9524 567.6577 575.9833 586.8296 616.1745 637.3801 691.7257 709.2367 728.5807 735.8957 752.2870 771.4583 774.0482 814.0789 833.5612 859.9661 877.3645 897.2477 914.4736 933.9155 939.4459 984.2876 989.3758 994.0028 998.9035 1002.3864 1013.0997 1028.1452 1040.9716 1057.2900 1071.6565 1078.6055 1085.2816 1093.6789 1100.0678 1102.3790 1111.7862 1174.3474 1184.8802 1192.7361 1197.9425 1206.3831 1209.0063 1264.7941 1267.3593 1267.7344 1293.2322 1304.6567 1321.5603 1322.4846 1329.6907 1348.6838 1356.5182 1369.7417 1375.4020 1390.9160 1397.1971 1431.8592 1440.5507 1452.1091 1460.6032 1466.3176 1469.9318 1474.3077 1476.7612 1477.2931 1481.1332 1487.5331 1491.8651 1572.3032 1585.7393 1602.8171 1612.1199 1637.9975 2962.9647 2974.7391 2975.8444 2984.4769 2985.5833 2992.2851 2997.6229 3006.9867 3027.3420 3052.2907 3055.2224 3073.0608 3073.5189 3077.0442 3080.3755 3087.2577 3087.8890 3113.0936 3119.1238 3127.9209 3140.0995 3151.9390 3165.1834 3495.1292 3655.0152
redmass: 5.5854 4.0029 3.1448 2.4067 2.6207 4.3496 4.9740 3.3035 1.2972 4.0994 3.2205 3.5707 2.8944 2.9967 3.2556 3.6234 2.7525 2.0881 1.6760 1.2932 3.5631 3.2758 2.7382 4.0276 3.9546 5.4802 4.6007 2.8771 3.7338 4.1388 3.5024 2.6995 3.7829 2.9940 2.5846 1.5784 1.1522 6.2696 3.6566 3.4043 1.7933 1.1228 2.0637 5.8882 2.0071 1.6011 1.5735 1.8450 1.2513 3.6904 1.8130 2.1074 1.5606 1.3535 1.3922 5.7715 1.7648 1.6337 2.4404 1.7214 2.3669 2.3697 2.0938 2.4233 1.7412 2.7108 1.9744 1.6863 1.7022 1.9925 1.0532 3.9210 1.3010 1.1444 1.4545 2.9346 1.2996 1.2707 1.2773 1.0928 1.1656 1.4240 1.3970 1.4474 2.1194 1.8623 1.2151 6.6905 1.2128 1.2085 2.1906 1.0684 1.0654 1.0809 1.0763 1.0998 1.0531 1.0653 1.0465 1.9981 1.0816 1.0594 1.4689 6.1135 7.8621 6.7850 3.6862 1.0589 1.0431 1.0525 1.0364 1.0607 1.0367 1.0646 1.0984 1.1012 1.0962 1.1032 1.1005 1.0997 1.0994 1.0953 1.0935 1.0921 1.0878 1.1014 1.0862 1.0918 1.0947 1.1012 1.0453 1.1033
irintensity: 1.5141 0.5602 0.2378 0.6126 0.6784 3.6846 2.6335 8.7562 1.1732 1.5924 0.5284 0.2587 0.7468 0.5732 0.5620 3.6983 0.9333 0.8102 0.1542 1.0074 8.7980 3.2031 0.8743 0.2909 3.2158 0.1683 0.3819 0.1497 4.0293 1.8127 1.5038 7.2069 4.7585 23.2453 73.5002 221.3703 4.0958 0.0653 4.0198 50.1508 46.8604 8.3697 9.2277 8.5678 36.7375 4.0086 25.5303 0.8220 0.0892 0.4839 3.7098 7.9704 0.9944 5.7400 0.2086 0.8872 2.4084 0.3027 0.5537 4.1524 10.2981 2.1341 0.7173 1.5303 8.4884 1.4410 7.9192 6.2999 12.7090 23.1140 0.2924 95.6903 4.8628 3.5718 5.4719 12.1502 12.1010 16.9076 0.7667 1.4735 2.1939 12.4399 7.1244 3.6532 45.3728 24.7122 57.4543 0.9367 11.0976 18.3166 7.2628 25.9048 15.6835 2.1092 1.1325 12.0947 11.2863 4.0971 11.4139 25.0648 14.8736 13.1148 57.4379 19.6353 98.3416 28.0568 230.8238 25.3016 24.8995 15.3231 23.2245 46.3733 3.3800 8.0942 9.9715 0.0387 1.4551 24.3668 79.1881 57.0582 35.4352 12.2089 19.2624 25.1258 5.1701 13.3829 0.2418 17.6397 19.7690 26.8951 23.8171 51.0042
temp: 298.150 k
press: 1.00000 atm
elementType: 16 8 8 7 6 6 6 6 6 6 6 6 6 6 6 6 6 6 6 6 6 1 1 1 1 1 1 1 1 1 1 1 1 1 1 1 1 1 1 1 1 1 1 1 1 1
symmnumber: 1
zpe: 1008928.5 jmol-1
zpe.correction: 0.384281 hartree
zpe.thermalcorrener: 0.408732 hartree
zpe.thermalcorrenthalpy: 0.409676 hartree
zpe.thermalcorrgfe: 0.326478 hartree
zpe.sumelectzpe: -1264.470891 hartree
zpe.sumelectthermal: -1264.446440 hartree
zpe.sumelectthermalent: -1264.445495 hartree
zpe.sumelectthermalfe: -1264.528693 hartree
dipole: -1.9648 -2.5675 -3.3758
dipole: 4.6743
quadrupole: -124.4186 -137.9884 -135.1940
quadrupole: -3.4512 -6.6656 -10.4227
quadrupole: 8.1151 -5.4548 -2.6603 -3.4512 -6.6656 -10.4227
hfenergy: -1264.8551715 hartree
pointgroup: C01 [X(C17H25N1O2S1)]
dipole: 0.7780892 -0.8598971 1.4272583 debye
polarizability: 281.0553968|-5.0670968|196.1301625|8.5548193|-15.6437453|169.1180766 unknown
InChI: InChI=1S/C17H25NO2S/c1-4-6-12-15(16(18)20)21-17(5-2,13(3)19)14-10-8-7-9-11-14/h7-11,15H,4-6,12,18H2,1-3H3
charge 0 multiplicity 1
46 atoms
S  -0.3245 -0.341889 0.878839
O  0.775749 2.733526 -0.77316
O  -2.872731 1.843221 -1.331314
N  -2.169534 2.233782 0.854428
C  1.096539 0.35173 -0.277159
C  -1.941517 -0.043674 -0.098892
C  0.771461 0.126869 -1.775737
C  -3.036809 -0.850853 0.652625
C  2.422157 -0.320674 0.115746
C  -4.412273 -0.811508 -0.056078
C  1.131092 1.868911 0.070967
C  0.667144 -1.35011 -2.200971
C  -5.46338 -1.677155 0.67624
C  -2.339918 1.43454 -0.25708
C  3.621127 0.290486 -0.346082
C  2.518927 -1.531776 0.843374
C  1.622233 2.279434 1.45654
C  -6.841983 -1.648072 -0.018049
C  4.879233 -0.28948 -0.081666
C  3.780399 -2.113069 1.11041
C  4.965111 -1.496419 0.651514
H  -1.808765 -0.45352 -1.112106
H  1.580042 0.6201 -2.350623
H  -0.14393 0.687336 -2.036418
H  -2.698516 -1.902929 0.731567
H  -3.141089 -0.465211 1.68646
H  -4.775389 0.231524 -0.125516
H  -4.300364 -1.167264 -1.100118
H  1.623049 -1.882404 -2.051399
H  -0.105321 -1.889704 -1.622515
H  0.402725 -1.416646 -3.271581
H  -5.567416 -1.320264 1.721555
H  -5.100657 -2.723696 0.738484
H  3.569105 1.222702 -0.923347
H  1.60799 -2.027268 1.194257
H  1.000021 3.108724 1.834581
H  2.657072 2.660961 1.369724
H  1.623208 1.443923 2.173464
H  -7.579653 -2.270318 0.521119
H  -7.239002 -0.616825 -0.066758
H  -6.771859 -2.02739 -1.054779
H  5.78996 0.197693 -0.447655
H  3.834031 -3.050789 1.674978
H  5.941121 -1.948695 0.859297
H  -1.632454 1.895353 1.654326
H  -2.418637 3.220089 0.787405
