program: Gaussian 09
title: 000271656
version: EM64L-G09RevD.01
frameworkgroup: C1[X(C19H27N3O2S)]
method: RPBEPBE
basis: SDD
operation: Freq
keyword: #p
keyword: freq=noraman
keyword: PBEPBE/SDD
title: #p freq=noraman PBEPBE/SDD
converged: YES YES NO NO
title: Mulliken charges:
elementType: S O O N N N C C C C C C C C C C C C C C C C C C C H H H H H H H H H H H H H H H H H H H H H H H H H H H
charge: 0.165811 -0.223660 -0.189318 -0.429029 -0.040514 -0.452109 0.068948 -0.466676 -0.394430 -0.379948 -0.021179 0.126485 -0.013929 -0.752382 -0.716685 -0.723297 0.193499 -0.581859 0.449640 -0.651762 -0.446193 -0.311541 -0.198100 -0.221006 -0.248822 0.222302 0.237234 0.199119 0.221690 0.231785 0.269111 0.193682 0.285313 0.279649 0.220359 0.214695 0.206574 0.212160 0.212003 0.209195 0.321100 0.301978 0.241750 0.249609 0.232007 0.230945 0.216962 0.216106 0.335681 0.230320 0.233447 0.233279
chargesum: 0.00000
title: Mulliken charges with hydrogens summed into heavy atoms:
elementType: S O O N N N C C C C C C C C C C C C C C C C C C C
charge: 0.165811 -0.223660 -0.189318 -0.107930 -0.040514 -0.150131 0.068948 -0.007140 0.026379 0.120948 0.172504 0.126485 -0.013929 -0.187420 -0.075057 -0.089939 0.193499 -0.090500 0.449640 0.028153 -0.230086 0.024140 0.032220 0.012441 -0.015543
polarizability: 3.58916265e+02 -3.77625949e+00 2.32430067e+02 -5.03899213e+00 2.11742164e+01 2.18163312e+02
1716.lowfreq: -18.4438 -7.2950 -2.6347 -0.0014 -0.0011 -0.0010 8.8669 18.7131 20.4504
frequency: -4.3052 17.1817 20.3899 30.0878 31.8767 34.5801 48.2751 52.5003 68.8384 89.3189 106.0116 119.0629 124.8774 139.3432 163.4606 184.0372 187.5016 195.0287 206.0788 226.1359 234.6607 237.6291 241.0664 260.5903 264.1925 284.5060 302.9888 324.5796 360.8574 376.9466 407.9067 410.0654 422.6398 478.4043 486.3169 493.9430 509.9509 549.4414 562.6504 609.9706 621.6404 626.4004 638.9530 675.5778 679.9207 696.2995 703.3059 711.3155 732.6592 752.7580 759.2083 769.2224 788.8719 790.9360 816.0577 834.7499 845.0390 882.3578 912.2838 925.5027 933.4197 947.8018 953.2944 961.8675 977.5545 984.6208 993.9056 997.7000 1013.6741 1022.5398 1026.6265 1029.9618 1042.1420 1060.1162 1071.2957 1085.8009 1106.4663 1130.8678 1147.5706 1164.3548 1173.5249 1175.4935 1187.6184 1188.4432 1204.3188 1231.3087 1238.7927 1247.0820 1248.5684 1266.1671 1274.5339 1290.9191 1296.7436 1316.6967 1322.2461 1324.4750 1330.8145 1335.1936 1354.2121 1375.5281 1383.9670 1392.2355 1395.6458 1408.5584 1440.6253 1442.3779 1448.6527 1459.1132 1461.5549 1463.6926 1468.4544 1469.7061 1472.8532 1481.0635 1483.0533 1483.8494 1487.5142 1537.3697 1558.0370 1605.7530 1611.6552 1632.1046 1637.4797 2953.6459 2963.9776 2966.6753 2972.5955 2985.5537 2992.0332 3005.0342 3006.9992 3024.9783 3031.7925 3054.9903 3060.0037 3065.0563 3066.7071 3069.3257 3070.5171 3076.9486 3079.5010 3097.9844 3104.1618 3107.3986 3136.6876 3148.9955 3168.5381 3188.1152 3489.0420 3524.1267
redmass: 5.1287 3.7854 2.8023 2.3177 2.6747 3.7867 3.9893 5.0833 4.7713 4.7799 7.0608 4.2862 2.7113 6.2103 5.9050 2.8763 3.7951 2.8737 1.0958 1.9174 1.1322 1.4147 3.5942 3.6415 4.7031 4.2050 3.8355 3.1883 3.5643 3.1536 2.9415 3.5459 2.5894 2.1857 9.4205 2.8604 5.0239 2.1861 4.3889 6.5228 3.8975 6.2116 1.4172 5.5728 9.2315 2.0502 3.1427 4.7126 2.3285 2.5869 1.3846 1.6757 1.3858 2.3687 2.9932 3.9341 1.2751 2.2705 1.1899 1.4055 2.5190 1.5130 2.7104 1.6531 1.3466 6.0431 3.5620 2.0583 1.3057 1.7651 2.0224 1.3953 2.9668 3.1708 2.4569 1.6375 2.5133 2.0798 2.3904 2.7035 1.0827 1.8097 1.7109 1.2277 2.6140 1.5437 1.2924 1.3105 1.8048 1.2666 1.2926 1.6799 1.3646 1.3525 1.4510 1.4238 1.3717 1.3500 1.4990 1.2127 4.1179 1.2167 1.2048 2.5691 1.0846 2.3781 1.0934 1.0878 1.0807 1.0927 1.0446 1.0392 1.0670 1.0544 2.3432 1.0486 1.0509 2.6454 5.9934 4.5979 5.6155 4.2378 11.1879 1.0827 1.0548 1.0389 1.0369 1.0354 1.0600 1.0564 1.0595 1.0996 1.0591 1.1019 1.0996 1.1002 1.1057 1.0991 1.0991 1.1023 1.0988 1.1034 1.0893 1.1057 1.0867 1.0931 1.0995 1.0961 1.0771 1.0758
irintensity: 1.1453 0.4402 0.0780 0.3862 0.6620 0.3241 0.0272 1.3084 2.2975 0.9481 0.7078 1.1303 1.0806 11.9048 1.4495 1.2246 1.3772 0.7032 0.1349 0.5054 0.0886 0.4914 0.2738 3.0114 4.0827 0.9470 7.3141 0.6146 5.8315 2.3721 0.0220 2.2065 3.9094 6.0892 1.8749 11.8823 18.0871 9.6233 1.3359 0.4395 1.5300 6.4095 116.2848 4.7125 10.9144 52.4245 11.2282 0.4308 11.4591 17.7248 13.7015 98.8188 5.4888 3.2822 1.1910 1.2337 0.2830 6.9372 3.0202 9.2873 5.2871 1.0724 28.3036 1.8188 0.2510 2.2976 38.3908 19.0600 3.6120 0.1110 22.2973 1.9000 1.1856 0.9031 4.0557 15.9919 37.3556 7.5122 12.5952 3.5052 0.3391 21.8992 148.1493 10.0885 20.4248 95.8863 24.2775 12.7216 161.5677 11.9132 11.7874 38.6953 24.9945 8.7951 64.1564 13.4179 6.4767 36.8046 6.3304 20.4274 29.9826 15.2719 18.8649 47.4882 36.4791 67.0036 5.1418 5.4316 4.9047 8.2995 2.8808 14.2190 5.3877 8.3163 81.1862 9.4413 24.8096 713.2216 561.8556 159.8037 65.7892 370.8540 31.5218 18.7522 18.6780 54.1107 20.2493 37.6270 10.6990 21.4594 24.5194 10.9915 14.8761 5.7631 15.6023 13.6338 3.2733 98.4137 72.6235 21.0317 25.9767 45.7113 15.8985 10.5186 0.3921 24.7251 21.4656 25.2790 17.7523 39.1410
temp: 298.150 k
press: 1.00000 atm
elementType: 16 8 8 7 7 7 6 6 6 6 6 6 6 6 6 6 6 6 6 6 6 6 6 6 6 1 1 1 1 1 1 1 1 1 1 1 1 1 1 1 1 1 1 1 1 1 1 1 1 1 1 1
symmnumber: 1
zpe: 1128664.2 jmol-1
zpe.correction: 0.429885 hartree
zpe.thermalcorrener: 0.456243 hartree
zpe.thermalcorrenthalpy: 0.457188 hartree
zpe.thermalcorrgfe: 0.370058 hartree
zpe.sumelectzpe: -1451.116913 hartree
zpe.sumelectthermal: -1451.090555 hartree
zpe.sumelectthermalent: -1451.089610 hartree
zpe.sumelectthermalfe: -1451.176740 hartree
dipole: -4.8529 1.8821 4.6773
dipole: 6.9978
quadrupole: -144.5483 -162.4646 -160.8324
quadrupole: -7.1606 -9.7084 2.9893
quadrupole: 11.4001 -6.5162 -4.8840 -7.1606 -9.7084 2.9893
hfenergy: -1451.5467981 hartree
pointgroup: C01 [X(C19H27N3O2S1)]
dipole: 1.5378911 -1.1943085 1.9463812 debye
polarizability: 344.6742285|-39.4272382|244.2518019|3.7010521|-24.1147597|220.5836141 unknown
InChI: InChI=1S/C19H27N3O2S/c1-4-25-13-12-19(11-10-14(2)3)16(23)21-18(22-17(19)24)20-15-8-6-5-7-9-15/h5-9,14,20-21H,4,10-13H2,1-3H3
charge 0 multiplicity 1
52 atoms
S  -4.098782 -3.034584 -0.777891
O  -2.192714 0.428021 2.208624
O  -0.441839 1.337837 -2.162153
N  -0.04684 -0.15061 1.589857
N  0.861518 0.193307 -0.62032
N  2.156328 -0.786062 1.11078
C  -1.651374 0.486841 -0.209176
C  -2.679284 1.633917 -0.406103
C  -2.160628 3.023889 0.025664
C  -2.219733 -0.891036 -0.770124
C  -3.227715 4.147355 -0.078111
C  -1.353793 0.282946 1.279079
C  -0.363973 0.739151 -1.05708
C  -3.578467 -1.313885 -0.182143
C  -3.699802 4.370635 -1.535797
C  -2.67182 5.463339 0.516797
C  0.987912 -0.231125 0.625993
C  -3.041445 -4.103231 0.383303
C  3.422598 -0.954566 0.467524
C  -3.387322 -5.58287 0.159706
C  4.44938 -1.55193 1.248389
C  3.686023 -0.56126 -0.870141
C  5.730725 -1.754081 0.698987
C  4.977167 -0.768423 -1.402257
C  6.003353 -1.361883 -0.632498
H  -3.586885 1.394441 0.178025
H  -2.947146 1.647062 -1.477349
H  -1.815698 2.972298 1.079084
H  -1.288272 3.304457 -0.597111
H  -1.472955 -1.690366 -0.596205
H  -2.31391 -0.773551 -1.8657
H  -4.106691 3.839141 0.528631
H  -3.577008 -1.322482 0.920854
H  -4.39072 -0.649541 -0.517444
H  -4.201681 3.478637 -1.951854
H  -2.838799 4.608132 -2.189734
H  -4.414691 5.21272 -1.592906
H  -2.358171 5.328568 1.569168
H  -3.430114 6.267862 0.487061
H  -1.790875 5.808189 -0.058626
H  0.133459 -0.308059 2.587266
H  2.128247 -1.137849 2.070853
H  -1.975812 -3.909502 0.16834
H  -3.265378 -3.789928 1.418546
H  -4.453975 -5.777309 0.369139
H  -3.179836 -5.888496 -0.881277
H  -2.783262 -6.222037 0.830109
H  4.248174 -1.856435 2.284651
H  2.886409 -0.108346 -1.458609
H  6.513572 -2.215562 1.310415
H  5.176737 -0.461477 -2.434732
H  6.998913 -1.518055 -1.060704
