program: Gaussian 09
title: 000271654
version: EM64L-G09RevD.01
frameworkgroup: C1[X(C16H23NO3S)]
method: RPBEPBE
basis: SDD
operation: Freq
keyword: #p
keyword: freq=noraman
keyword: PBEPBE/SDD
title: #p freq=noraman PBEPBE/SDD
converged: YES YES NO NO
title: Mulliken charges:
elementType: S O O O N C C C C C C C C C C C C C C C C H H H H H H H H H H H H H H H H H H H H H H H
charge: 0.119461 -0.265477 -0.418444 -0.217277 -0.598533 -0.355243 -0.470901 -0.395285 -0.404015 0.469768 -0.328821 0.214180 -0.351598 -0.701638 0.231058 -0.377802 -0.368953 -0.696091 -0.239576 -0.245737 -0.240556 0.302325 0.258460 0.250019 0.238968 0.213726 0.184577 0.211334 0.200502 0.195065 0.214311 0.241050 0.219871 0.277226 0.251096 0.212223 0.210512 0.218651 0.227669 0.226488 0.331097 0.341444 0.229915 0.384951
chargesum: 0.00000
title: Mulliken charges with hydrogens summed into heavy atoms:
elementType: S O O O N C C C C C C C C C C C C C C C C
charge: 0.119461 -0.265477 -0.033492 -0.217277 0.074008 -0.355243 -0.168576 0.113194 0.048679 0.469768 0.067090 0.214180 0.043969 -0.026405 0.231058 -0.100576 -0.117857 -0.054705 -0.011907 -0.019249 -0.010641
polarizability: 2.52078384e+02 9.12522777e+00 2.13521442e+02 -4.25224464e+00 7.99098921e+00 1.54395320e+02
1716.lowfreq: -15.9317 -9.8359 -7.3384 -0.0026 -0.0023 -0.0019 6.1691 28.0975 31.3068
frequency: -12.7517 27.2033 31.2451 50.0615 52.0949 59.2720 74.7832 90.4314 95.8351 102.3176 124.7428 127.8109 148.1198 165.4959 187.5804 204.9318 219.4585 225.3447 234.4917 262.3730 275.6982 290.0561 313.5543 329.8456 362.5855 389.9424 401.6955 408.1029 451.4492 484.3347 509.2206 560.0257 573.5249 592.0773 607.3089 613.1049 623.8062 632.7556 646.7283 704.9948 707.9479 715.9455 735.3610 750.1718 772.9290 797.1630 832.0266 859.2163 862.0876 890.0068 914.3240 923.6801 925.4085 957.8548 985.5355 988.8551 995.5563 1000.7021 1030.7016 1040.5645 1051.9885 1062.5309 1080.1217 1082.7062 1083.5603 1094.2970 1104.2724 1112.8012 1116.8694 1174.4946 1182.8424 1189.3538 1203.4081 1213.7843 1236.9004 1263.5118 1265.6986 1286.3307 1291.2428 1317.1972 1322.8334 1328.6146 1336.0007 1348.7466 1358.7973 1373.6097 1388.4188 1390.6147 1431.6109 1457.3716 1467.3265 1468.3651 1473.3685 1477.2104 1478.2150 1480.9328 1487.7335 1489.9589 1557.7397 1585.4672 1607.7744 1620.3803 1658.5069 2962.6069 2969.8285 2974.0711 2979.3934 2982.7136 3006.5943 3010.9305 3028.1192 3049.9439 3057.1920 3070.5323 3074.2716 3076.0030 3077.2697 3088.2983 3124.1986 3132.7511 3145.1444 3152.3495 3164.9771 3476.9279 3514.2011 3644.2688
redmass: 3.7865 4.9558 4.6211 1.7021 4.0436 8.5928 5.3701 4.1732 3.2538 4.2767 2.7294 4.9838 3.2519 2.6516 3.3715 1.7396 2.0108 4.5167 1.3368 4.2964 4.3955 2.7150 5.4893 4.6280 4.3770 4.2756 2.8739 3.7834 3.3362 4.5834 3.1970 1.8704 2.8566 2.6027 2.9637 3.8015 2.0072 1.6000 1.5473 1.8376 4.3311 2.6453 1.3001 1.6351 1.9103 1.3226 2.0194 1.2906 3.3483 3.0342 2.0322 1.5455 1.3728 2.7550 1.3726 6.0499 3.8672 1.3266 2.4424 2.3783 1.7557 1.8242 2.3896 2.2364 2.3932 1.9523 1.6770 1.9965 2.0715 1.0560 3.0124 1.5075 1.1269 1.3684 1.2837 1.2603 1.3104 1.1823 1.0560 1.5815 1.5818 2.5877 1.4043 1.6144 1.6369 6.3273 1.2180 1.2143 2.2585 1.0742 1.0489 1.0613 1.1609 1.0670 1.0426 1.7756 1.0840 1.0689 1.5795 5.6683 5.8456 3.5322 7.6532 1.0600 1.0612 1.0362 1.0639 1.0360 1.0960 1.0612 1.0988 1.1012 1.0985 1.1005 1.0993 1.0992 1.0874 1.0997 1.0846 1.0881 1.0922 1.0957 1.1015 1.0471 1.0641 1.1020
irintensity: 0.0618 0.0869 0.6578 0.3739 1.8167 5.1308 1.0588 2.7226 1.8532 1.5502 0.1633 0.1212 1.0430 0.3275 2.4317 0.1088 0.2401 4.1275 0.0584 0.6787 10.1091 0.8779 1.6636 2.5409 0.5899 0.7286 0.1360 6.1531 3.3323 8.9369 5.5981 108.7781 21.0074 46.0901 6.4699 84.5035 209.5399 10.2514 1.9903 49.1989 12.8980 18.0130 4.8984 18.2157 37.3014 2.2263 34.0178 1.6801 3.9699 2.5916 1.6501 7.3550 9.1656 1.7855 0.6580 1.0940 64.2307 0.0968 11.3499 117.8506 5.7825 15.0745 11.6149 11.2397 2.1284 3.2616 8.8782 3.2223 22.4726 0.0540 3.7367 2.2494 6.2787 5.4622 3.6216 12.4600 8.6687 2.9786 4.6639 14.0680 32.0254 75.2967 5.4386 9.0798 12.2927 0.4087 20.0544 9.3791 12.6726 5.5353 2.8398 3.2768 10.1428 3.3892 12.8612 27.4190 18.6901 12.7146 94.8272 2.1615 9.9147 140.5160 320.4237 2.6148 40.1885 35.6547 35.8089 27.9282 4.8662 3.6892 8.4683 20.1378 1.7827 72.3904 59.3078 25.9513 22.6252 38.2983 0.3571 8.6830 11.8355 19.0807 30.0603 33.0582 29.4031 59.9975
temp: 298.150 k
press: 1.00000 atm
elementType: 16 8 8 8 7 6 6 6 6 6 6 6 6 6 6 6 6 6 6 6 6 1 1 1 1 1 1 1 1 1 1 1 1 1 1 1 1 1 1 1 1 1 1 1
symmnumber: 1
zpe: 949275.9 jmol-1
zpe.correction: 0.361560 hartree
zpe.thermalcorrener: 0.384248 hartree
zpe.thermalcorrenthalpy: 0.385192 hartree
zpe.thermalcorrgfe: 0.308565 hartree
zpe.sumelectzpe: -1300.405405 hartree
zpe.sumelectthermal: -1300.382718 hartree
zpe.sumelectthermalent: -1300.381774 hartree
zpe.sumelectthermalfe: -1300.458401 hartree
dipole: 1.2773 -1.4532 -0.2118
dipole: 1.9463
quadrupole: -128.4678 -129.5756 -136.1542
quadrupole: 2.6707 8.0370 -0.2236
quadrupole: 2.9314 1.8236 -4.7550 2.6707 8.0370 -0.2236
hfenergy: -1300.7669656 hartree
pointgroup: C01 [X(C16H23N1O3S1)]
dipole: 0.4822837 -0.5828872 -0.1182655 debye
polarizability: 252.2412475|8.4386361|212.4131689|-6.8113935|9.8054182|155.3407302 unknown
InChI: InChI=1S/C16H23NO3S/c1-3-5-11-13(14(18)19)21-16(4-2,15(17)20)12-9-7-6-8-10-12/h6-10,13,18H,3-5,11,17H2,1-2H3
charge 0 multiplicity 1
44 atoms
S  0.599185 -0.150371 -0.662724
O  -2.011401 2.599979 0.797949
O  1.419303 2.933792 0.964653
O  2.249294 2.8581 -1.207894
N  -1.084905 2.271923 -1.298984
C  -0.962459 0.404692 0.369415
C  2.076184 0.779899 0.137075
C  -0.681664 0.351088 1.900504
C  3.373158 0.194569 -0.463852
C  -2.109907 -0.561274 -0.022625
C  3.678056 -1.248852 -0.007266
C  -1.376831 1.863789 -0.019121
C  4.996939 -1.785057 -0.609279
C  -0.277772 -1.028562 2.449916
C  1.945263 2.265953 -0.149576
C  -3.455981 -0.127237 0.126815
C  -1.875885 -1.896163 -0.443965
C  5.327006 -3.217968 -0.139297
C  -4.530215 -0.998999 -0.153019
C  -2.953399 -2.765468 -0.72881
C  -4.286542 -2.322429 -0.586092
H  2.023228 0.604543 1.222943
H  -1.612256 0.695341 2.388859
H  0.077612 1.115329 2.147464
H  3.326141 0.256074 -1.567779
H  4.208272 0.857013 -0.156496
H  3.742626 -1.279365 1.100608
H  2.842694 -1.918006 -0.29204
H  4.927396 -1.763314 -1.71576
H  5.829094 -1.104385 -0.33612
H  0.648526 -1.404716 1.976857
H  -1.068615 -1.77946 2.278497
H  -0.104097 -0.960716 3.539217
H  -3.662322 0.892261 0.469623
H  -0.84968 -2.262752 -0.548918
H  4.525374 -3.924366 -0.426127
H  5.432471 -3.260035 0.96126
H  6.271862 -3.581231 -0.583108
H  -5.558903 -0.641282 -0.031508
H  -2.746156 -3.790231 -1.057312
H  -1.406064 3.190698 -1.602606
H  -0.504459 1.695608 -1.912454
H  -5.121709 -2.996687 -0.805978
H  1.258336 3.892177 0.747055
