program: Gaussian 09
title: 000271651
version: EM64L-G09RevD.01
frameworkgroup: C1[X(C18H21Br)]
method: RPBEPBE
basis: SDD
operation: Freq
keyword: #p
keyword: freq=noraman
keyword: PBEPBE/SDD
title: #p freq=noraman PBEPBE/SDD
converged: YES YES NO NO
title: Mulliken charges:
elementType: Br C C C C C C C C C C C C C C C C C C H H H H H H H H H H H H H H H H H H H H H
charge: -0.016029 -0.624035 -0.612278 0.431924 0.418914 0.104824 0.115715 0.420330 0.355582 -0.448533 -0.443337 -0.861851 -0.834946 -0.376500 -0.219092 -0.447692 -0.238128 -0.855330 -0.818702 0.230375 0.234567 0.227447 0.229727 0.237833 0.228738 0.244727 0.237049 0.238890 0.228209 0.230377 0.236887 0.247971 0.230376 0.223313 0.257144 0.257398 0.248733 0.223552 0.226505 0.229349
chargesum: 0.00000
title: Mulliken charges with hydrogens summed into heavy atoms:
elementType: Br C C C C C C C C C C C C C C C C C C
charge: -0.016029 -0.159092 -0.155105 0.431924 0.418914 0.104824 0.115715 0.420330 0.355582 -0.210701 -0.214600 -0.141185 -0.139473 -0.376500 0.028878 -0.217317 -0.014815 -0.092055 -0.139297
polarizability: 3.13125094e+02 4.20326432e+00 2.17647670e+02 1.75640243e+01 -3.74234875e+00 1.09955461e+02
1716.lowfreq: -3.3201 -0.0006 -0.0004 -0.0002 6.1247 13.3770 24.8076 28.6743 33.0357
frequency: 24.7730 28.5533 33.0142 70.8249 72.9957 94.6580 112.2934 118.0999 134.5151 164.4849 167.5243 190.5136 197.7444 232.9060 257.7123 266.0350 304.0506 313.5693 349.5283 357.4712 365.0030 384.6262 456.0173 476.3474 491.8136 498.3096 510.0606 511.8656 529.5945 562.1681 580.9968 595.9880 652.7760 693.7986 735.7458 748.6842 781.4247 793.0983 810.9386 816.4108 822.3872 886.0117 896.4632 910.9836 949.4715 972.2712 987.0171 991.9867 999.5193 1002.4056 1023.0779 1026.5619 1049.5671 1051.6516 1056.9685 1080.8780 1092.8545 1128.2261 1152.1234 1176.1151 1185.4908 1196.4658 1216.6680 1249.0220 1251.2306 1263.5404 1280.6748 1284.4769 1332.9883 1351.3265 1369.2287 1393.1313 1396.2660 1402.7842 1405.1547 1412.0879 1435.2941 1439.7536 1454.5344 1461.7977 1463.7453 1465.9697 1475.1593 1479.8028 1482.8207 1486.8763 1494.1793 1504.3529 1512.1910 1577.6307 1585.9190 1596.8377 1605.6014 2967.9849 2970.6518 2981.3965 2986.9760 2993.9308 3004.6277 3037.1380 3037.7044 3042.2335 3052.4744 3057.5146 3061.3719 3083.5154 3100.4029 3108.8158 3110.4608 3119.8969 3121.8886 3125.0655 3150.9449 3170.2343
redmass: 4.7374 3.6572 4.9762 1.8572 3.9416 1.3870 1.3896 2.5877 3.3690 1.3063 2.2107 2.3613 1.5216 2.9981 4.0534 3.0154 3.9699 2.3564 2.6957 3.8993 2.5173 2.6621 2.5558 4.1128 3.5735 3.8212 3.0506 3.2620 4.3942 5.2388 3.7437 5.1171 4.2193 3.7973 2.3327 2.9212 1.4013 1.5646 2.5438 3.6960 1.7651 2.3461 1.7055 1.8239 1.3906 1.3694 1.6962 1.7115 2.4662 1.4689 1.4280 1.5651 1.6181 1.6583 1.7821 1.9435 1.9295 2.0855 1.2952 1.1780 1.9728 3.4463 2.1996 2.0797 1.5971 2.0757 1.2329 1.7491 1.4442 5.5355 5.5760 1.2477 1.2632 1.4485 1.2205 2.4173 2.4118 1.7194 2.7660 1.1044 1.0790 1.0599 1.1609 1.2079 1.1675 1.0949 1.0816 1.0938 1.0943 6.0992 7.1197 6.6234 6.0076 1.0380 1.0413 1.0406 1.0401 1.0596 1.0604 1.0986 1.0964 1.0959 1.0972 1.0967 1.1034 1.0979 1.0951 1.0946 1.0867 1.0954 1.0906 1.0895 1.0992 1.0954
irintensity: 0.2095 0.2622 0.0113 0.0266 0.0472 0.1456 0.1846 0.0176 0.0456 1.1782 0.4991 1.2398 1.3351 0.7763 2.3497 9.4156 6.6783 0.7469 2.5325 3.3178 0.7673 0.2161 0.4902 0.4320 0.2303 1.1501 0.0867 0.3519 3.0558 4.4188 7.0321 6.8786 0.4997 1.8665 17.4248 3.6539 11.7753 20.2128 20.3993 19.7356 22.0029 5.2029 10.8088 7.0001 0.4843 0.0576 8.1021 4.3875 6.9613 33.6365 17.0321 1.4061 0.5200 1.0373 40.2393 0.6611 8.4510 11.4597 6.9929 0.4515 8.2118 0.2719 0.9603 0.7663 3.0262 0.4000 0.0177 7.0921 0.0449 1.3928 0.8519 2.4147 3.8916 38.7215 16.1738 0.6464 39.6015 1.8087 10.1586 8.7618 0.7825 23.7052 4.4383 22.0544 45.6766 7.7485 7.9584 5.4902 19.3428 7.0057 1.6474 12.5450 1.3319 49.3873 17.1725 22.4027 18.6557 1.4890 51.3435 6.7293 37.6622 2.1876 20.3175 9.4937 32.5560 28.9853 24.5764 31.7358 5.0081 14.2326 29.7046 15.5319 34.6314 5.9440
temp: 298.150 k
press: 1.00000 atm
elementType: 35 6 6 6 6 6 6 6 6 6 6 6 6 6 6 6 6 6 6 1 1 1 1 1 1 1 1 1 1 1 1 1 1 1 1 1 1 1 1 1
symmnumber: 1
zpe: 876514.1 jmol-1
zpe.correction: 0.333847 hartree
zpe.thermalcorrener: 0.353621 hartree
zpe.thermalcorrenthalpy: 0.354565 hartree
zpe.thermalcorrgfe: 0.283598 hartree
zpe.sumelectzpe: -710.601740 hartree
zpe.sumelectthermal: -710.581966 hartree
zpe.sumelectthermalent: -710.581021 hartree
zpe.sumelectthermalfe: -710.651989 hartree
dipole: 2.3048 0.4708 0.3257
dipole: 2.3748
quadrupole: -128.5803 -111.4207 -129.3353
quadrupole: -8.4318 2.0743 -0.5424
quadrupole: -5.4682 11.6914 -6.2232 -8.4318 2.0743 -0.5424
hfenergy: -710.9355868 hartree
pointgroup: C01[X(C18H21Br1)]
dipole: -0.8960755 0.2225655 -0.1431022 debye
polarizability: 312.224891|-7.9898221|218.3156266|19.6444189|-0.8555688|110.1877069 unknown
InChI: InChI=1S/C18H21Br/c1-12-6-5-7-16(13(12)2)8-9-17-10-11-18(19)15(4)14(17)3/h5-7,10-11H,8-9H2,1-4H3
charge 0 multiplicity 1
40 atoms
Br 6.195612 -1.078789 0.345835
C  0.045611 -0.086774 -0.678838
C  -0.724609 0.213998 0.649381
C  1.54523 -0.251758 -0.463553
C  -2.223198 0.386034 0.429901
C  2.432979 0.858931 -0.314108
C  -3.107373 -0.724059 0.266992
C  3.82899 0.639057 -0.065997
C  -4.496189 -0.488421 0.018384
C  2.062219 -1.568309 -0.372357
C  -2.742033 1.705002 0.349096
C  1.9180 2.289798 -0.41731
C  -2.614382 -2.16201 0.342769
C  4.282093 -0.701227 0.015979
C  3.428842 -1.808519 -0.133159
C  -4.980316 0.83962 -0.063055
C  -4.109765 1.937922 0.103325
C  4.804103 1.789909 0.10517
C  -5.461271 -1.648914 -0.15847
H  -0.18138 0.718501 -1.402012
H  -0.364157 -1.014757 -1.118216
H  -0.504609 -0.597341 1.368543
H  -0.311233 1.137827 1.094817
H  1.38402 -2.421013 -0.495568
H  -2.059555 2.553408 0.486029
H  0.850996 2.324061 -0.682585
H  2.038862 2.834302 0.538668
H  2.466278 2.861808 -1.1884
H  -3.231553 -2.760251 1.039157
H  -2.681317 -2.662016 -0.64414
H  -1.569148 -2.233657 0.681095
H  3.819535 -2.827531 -0.068613
H  -6.046501 1.010324 -0.254982
H  -4.495539 2.961901 0.045592
H  5.346448 1.70433 1.064667
H  5.573346 1.776143 -0.689777
H  4.306531 2.769908 0.081308
H  -5.14876 -2.322759 -0.979235
H  -5.525952 -2.271654 0.755202
H  -6.477451 -1.286326 -0.388535
