program: Gaussian 09
title: 000271649
version: EM64L-G09RevD.01
frameworkgroup: C1[X(C23H28O3)]
method: RPBEPBE
basis: SDD
operation: Freq
keyword: #pfreq=noraman
keyword: PBEPBE/SDD
title: #p freq=noraman PBEPBE/SDD
converged: YES YES NO NO
title: Mulliken charges:
elementType: O O O C C C C C C C C C C C C C C C C C C C C C C C H H H H H H H H H H H H H H H H H H H H H H H H H H H H
charge: -0.251353 -0.222150 -0.213420 -0.380970 -0.379739 -0.372306 -0.375759 -0.353456 -0.407037 -0.356484 -0.322000 -0.695869 0.356912 -0.387685 -0.350703 0.324805 -0.300375 -0.363108 -0.002645 -0.002941 0.319036 -0.324585 -0.355077 -0.237253 -0.228864 -0.224816 0.193405 0.191980 0.195767 0.197999 0.191343 0.190097 0.192782 0.194126 0.187801 0.188492 0.217707 0.219268 0.195497 0.195021 0.213470 0.215059 0.209709 0.209860 0.216099 0.256552 0.255166 0.266755 0.273890 0.264750 0.275297 0.232655 0.233756 0.233538
chargesum: 0.00000
title: Mulliken charges with hydrogens summed into heavy atoms:
elementType: O O O C C C C C C C C C C C C C C C C C C C C C C C
charge: -0.251353 -0.222150 -0.213420 0.004415 0.014027 0.009134 0.011148 0.022836 0.029938 0.034034 0.106529 -0.060201 0.356912 -0.131132 -0.095537 0.324805 -0.033620 -0.089218 -0.002645 -0.002941 0.319036 -0.059834 -0.079780 -0.004598 0.004893 0.008721
polarizability: 4.44224096e+02 1.55959591e+01 2.27223056e+02 -2.36736966e+01 1.00651748e+01 1.77698089e+02
1716.lowfreq: -1.1990 -0.0017 -0.0009 0.0011 2.3606 8.4039 10.0585 16.7143 21.3067
frequency: 8.3150 16.6846 21.2935 32.5875 35.0683 39.1367 48.0362 67.6566 72.5025 83.8972 106.5439 113.2494 122.6565 124.5374 137.6374 145.1550 150.4619 157.7841 162.7865 186.2790 226.1534 228.6616 263.6675 281.1218 284.5023 321.1787 345.0952 363.5638 397.5385 407.5973 413.4933 431.4642 451.9934 463.1113 487.3990 511.4393 523.3529 612.0081 614.0226 626.8853 664.5947 689.1374 694.8833 716.7294 720.9050 726.9585 745.0717 758.9104 778.3043 788.9412 806.9477 821.1146 832.1856 840.3593 859.1134 864.0474 888.3200 891.7591 950.6218 954.9792 958.6877 971.7361 985.3497 988.5954 991.8647 992.8871 997.1949 1008.9107 1010.0614 1018.6489 1019.0778 1040.2801 1041.5770 1065.9551 1077.0604 1080.6415 1087.1762 1093.2867 1123.9395 1126.4841 1148.6232 1171.9634 1175.4853 1185.5842 1191.6381 1216.0899 1217.2902 1220.6880 1240.3865 1251.8002 1256.0337 1278.3276 1282.3262 1287.4363 1292.5824 1297.3924 1299.0513 1300.4012 1310.6047 1320.2585 1326.1957 1350.0619 1356.3835 1360.4055 1369.1518 1382.3850 1388.9063 1388.9332 1434.9261 1436.8035 1461.5656 1461.8866 1466.0580 1468.0623 1471.5168 1476.4503 1476.6402 1477.0903 1481.9010 1487.1764 1489.6462 1498.9665 1528.0833 1543.3498 1568.8089 1587.5334 1608.6347 1618.5164 2951.7270 2952.5641 2954.0871 2956.9238 2958.5108 2965.2317 2969.1521 2972.3251 2984.6968 2991.3003 2996.0137 2999.8775 3012.7124 3016.5931 3028.6750 3041.1401 3065.3714 3068.6802 3071.0788 3129.6187 3141.9502 3146.5291 3153.7718 3161.3609 3164.8469 3168.8988 3178.4708 3182.5664
redmass: 5.3310 4.9116 4.8505 2.2674 2.9353 4.0500 2.9981 4.5706 2.8854 1.8341 3.7315 5.2371 5.0191 1.9009 3.0727 4.9911 2.0112 4.9474 2.5642 5.3294 4.0318 1.1507 6.3519 4.6009 7.0725 4.8601 9.1268 3.3510 2.8962 4.3679 3.2549 5.8363 3.6855 3.7479 3.5746 3.0287 3.6947 6.7373 7.5542 6.9556 6.1606 2.6886 3.6537 2.4643 1.0612 1.0782 1.1059 3.3775 1.1513 4.4910 3.4640 1.2567 1.2353 2.2578 1.2515 3.2257 1.9076 1.2116 1.4436 7.6171 1.1962 1.3680 1.3567 4.4573 4.3744 1.5316 3.2244 1.3470 3.9880 3.0247 1.1080 2.6868 3.2654 2.8610 2.5437 2.1221 1.5807 2.3228 1.6089 2.1764 1.4145 1.2252 1.1530 1.7288 1.1344 1.2893 1.4330 3.0171 2.9976 1.3043 1.3041 1.1303 1.0891 1.0687 1.3072 1.0929 1.1289 2.8316 1.5534 1.3691 1.3656 1.4854 1.6643 1.6070 3.9313 1.5798 1.2193 8.7987 2.5201 3.9498 1.0738 1.0739 1.0709 1.0789 1.0981 1.1658 1.0444 1.9949 1.1094 1.1203 1.1188 2.1009 9.8466 9.9249 7.2950 6.3554 6.0428 6.3833 1.0586 1.0587 1.0574 1.0573 1.0587 1.0590 1.0585 1.0366 1.0964 1.0982 1.0592 1.1008 1.1031 1.1064 1.1050 1.1048 1.1053 1.1006 1.0993 1.0855 1.0889 1.0882 1.0937 1.0886 1.0982 1.0955 1.0974 1.0969
irintensity: 0.2601 0.5948 0.9617 0.1121 0.5537 0.1439 0.3530 0.4307 0.0846 0.0363 0.5634 1.1436 0.1846 0.0650 2.8823 0.9573 0.1125 2.6404 2.9063 0.3238 3.4832 0.1116 13.0920 1.4434 16.1221 0.2242 2.2227 0.5654 0.0515 0.2342 0.1313 0.8969 1.2420 2.5730 0.2112 11.6853 14.5206 41.3138 102.9049 9.8856 15.3472 12.8009 41.6006 41.5690 15.1535 0.3183 6.2244 18.1124 0.5234 24.0645 38.3063 2.2280 8.5080 79.7581 2.4723 75.8812 4.5581 1.6848 1.6389 115.0112 1.3835 0.4946 1.1797 0.9795 5.4824 1.1690 0.1109 0.0959 11.1828 13.8600 0.2732 5.2195 2.2232 2.4519 7.2714 0.0973 8.4049 18.3434 16.7212 9.0179 0.7940 339.4865 199.1991 0.4652 7.0778 14.4833 1.4197 173.5089 378.5969 0.0302 8.2869 0.0302 0.0437 0.9241 1.6036 0.0123 0.0707 20.2375 14.4453 3.9557 0.5988 0.6067 0.4861 0.2650 42.2102 60.4792 11.1797 6.9933 14.6226 8.1080 0.1207 0.0176 0.1000 3.3006 19.2207 13.0677 12.2298 1.0718 25.4605 8.3833 53.0941 49.6740 271.2011 219.8738 94.9263 9.9469 26.3610 263.3092 0.0788 0.1539 3.6267 23.3550 3.4302 25.8684 186.2869 36.7363 0.1771 0.6625 36.0611 1.1603 7.5873 11.2210 1.8000 131.5352 85.0385 104.8202 55.5569 0.3716 9.2187 1.0290 13.0757 2.2668 32.6974 16.6300 10.7471 3.7902
temp: 298.150 k
press: 1.00000 atm
elementType: 8 8 8 6 6 6 6 6 6 6 6 6 6 6 6 6 6 6 6 6 6 6 6 6 6 6 1 1 1 1 1 1 1 1 1 1 1 1 1 1 1 1 1 1 1 1 1 1 1 1 1 1 1 1
symmnumber: 1
zpe: 1184628.9 jmol-1
zpe.correction: 0.451201 hartree
zpe.thermalcorrener: 0.478214 hartree
zpe.thermalcorrenthalpy: 0.479158 hartree
zpe.thermalcorrgfe: 0.388088 hartree
zpe.sumelectzpe: -1116.978857 hartree
zpe.sumelectthermal: -1116.951845 hartree
zpe.sumelectthermalent: -1116.950901 hartree
zpe.sumelectthermalfe: -1117.041971 hartree
dipole: -3.6011 1.7093 -2.5553
dipole: 4.7349
quadrupole: -137.4531 -156.4399 -159.8086
quadrupole: 5.2412 -23.7882 -0.6216
quadrupole: 13.7808 -5.2061 -8.5747 5.2412 -23.7882 -0.6216
hfenergy: -1117.4300584 hartree
pointgroup: C01 [X(C23H28O3)]
dipole: 1.4362798 -1.1501687 0.290611 debye
polarizability: 443.2109011|32.3084213|178.1098642|-5.6144005|-8.3131528|227.8244751 unknown
InChI: InChI=1S/C23H28O3/c1-2-3-4-5-6-7-11-18-26-21-16-14-20(15-17-21)23(25)22(24)19-12-9-8-10-13-19/h8-10,12-17H,2-7,11,18H2,1H3
charge 0 multiplicity 1
54 atoms
O  1.342817 0.080843 -0.983588
O  -4.450681 0.984884 1.756454
O  -5.200765 1.103963 -1.554486
C  7.55058 -0.078904 0.344826
C  6.31418 -0.132015 -0.580458
C  8.880851 -0.32652 -0.401847
C  4.984397 0.119516 0.165688
C  10.116878 -0.301918 0.525476
C  3.75283 0.015239 -0.763688
C  11.447187 -0.54685 -0.222987
C  2.446171 0.277207 -0.014018
C  12.676034 -0.53271 0.711727
C  0.033031 0.251055 -0.545719
C  -0.972104 0.021282 -1.523449
C  -0.330815 0.626354 0.778206
C  -2.708942 0.536471 0.136477
C  -2.324894 0.163057 -1.187147
C  -1.689321 0.765106 1.10281
C  -4.120247 0.664497 0.569057
C  -5.256445 0.462175 -0.460213
C  -6.408987 -0.422913 -0.116428
C  -6.45552 -1.196186 1.076787
C  -7.478543 -0.516304 -1.051549
C  -7.552213 -2.048528 1.323505
C  -8.572525 -1.364681 -0.799361
C  -8.611427 -2.134613 0.389857
H  7.591781 0.909498 0.848747
H  7.437363 -0.83411 1.150698
H  6.272039 -1.123334 -1.077857
H  6.428255 0.617887 -1.390471
H  9.003792 0.43865 -1.196785
H  8.832491 -1.307197 -0.920186
H  4.887885 -0.613379 0.993901
H  5.015529 1.123771 0.637833
H  9.996859 -1.070312 1.317905
H  10.166696 0.67673 1.04755
H  3.707469 -0.993775 -1.216346
H  3.843111 0.738198 -1.59667
H  11.569744 0.225574 -1.009655
H  11.393486 -1.521083 -0.750778
H  2.320553 -0.432438 0.829568
H  2.408888 1.3137 0.379368
H  12.592573 -1.317571 1.487184
H  12.768898 0.440652 1.229709
H  13.613612 -0.708421 0.152758
H  -0.661554 -0.260297 -2.533784
H  0.429781 0.808131 1.542454
H  -3.088869 0.002052 -1.952103
H  -1.994428 1.052457 2.114882
H  -5.649806 -1.116436 1.811441
H  -7.422845 0.086452 -1.964387
H  -7.585555 -2.640174 2.244638
H  -9.393683 -1.430423 -1.521365
H  -9.46279 -2.796103 0.586517
