program: Gaussian 09
title: 000271646
version: EM64L-G09RevD.01
frameworkgroup: C1[X(C16H10N2O8)]
method: RPBEPBE
basis: SDD
operation: Freq
keyword: #p
keyword: freq=noraman
keyword: PBEPBE/SDD
title: #p freq=noraman PBEPBE/SDD
converged: YES YES NO NO
title: Mulliken charges:
elementType: O O O O O O O O N N C C C C C C C C C C C C C C C C H H H H H H H H H H
charge: -0.173364 -0.166166 -0.402086 -0.188509 -0.192454 -0.193600 -0.197602 -0.200899 0.022029 0.022000 -0.418829 0.113056 0.115187 0.377746 0.401599 0.163925 -0.437055 -0.454480 -0.360314 -0.362314 0.346024 0.347170 -0.189705 -0.193413 -0.356304 -0.361739 0.288199 0.298951 0.285115 0.289397 0.289721 0.251594 0.250568 0.295590 0.294677 0.396284
chargesum: 0.00000
title: Mulliken charges with hydrogens summed into heavy atoms:
elementType: O O O O O O O O N N C C C C C C C C C C C C C C C C
charge: -0.173364 -0.166166 -0.005802 -0.188509 -0.192454 -0.193600 -0.197602 -0.200899 0.022029 0.022000 -0.130630 0.113056 0.115187 0.377746 0.401599 0.163925 -0.138104 -0.169365 -0.070917 -0.072593 0.346024 0.347170 0.061889 0.057155 -0.060714 -0.067062
polarizability: 2.76806967e+02 -2.06147558e+01 2.16602395e+02 -1.82348094e+01 -4.05877182e+00 1.66632809e+02
1716.lowfreq: -3.7086 -2.6271 -0.0008 0.0002 0.0008 6.7298 14.9001 17.9757 23.3008
frequency: 14.8660 17.9492 23.2831 36.2866 45.5762 56.5322 60.8728 72.2534 79.0008 118.3043 121.5294 146.1793 156.3724 178.5670 182.9638 191.1348 217.2882 256.2774 303.9337 320.3065 335.0920 362.3840 379.1799 417.1607 418.5967 435.6786 443.5166 451.8954 458.1663 520.0880 530.5761 536.8037 570.4149 589.0708 631.7673 646.5907 647.7390 654.8491 678.3161 690.7545 695.6004 704.0954 713.2891 721.1398 784.2744 810.8914 831.4262 833.8972 870.1015 878.1452 903.3380 943.2037 950.3169 973.7425 975.4910 988.2697 989.1952 1002.7765 1011.4188 1018.0205 1019.3569 1047.2906 1086.0094 1087.0047 1098.4858 1099.0231 1174.3160 1175.8073 1192.5673 1205.5843 1214.1858 1220.9645 1254.6058 1259.0776 1293.3182 1297.8890 1310.7132 1375.8309 1377.4341 1399.1345 1399.8774 1432.8431 1433.5326 1471.6803 1472.3957 1572.7420 1576.9515 1596.7058 1602.5935 1616.8115 1619.9350 1671.0574 3020.5202 3155.4753 3155.6567 3165.7637 3171.2709 3171.5305 3174.8818 3187.4746 3187.8067 3518.5813
redmass: 10.6957 7.6610 6.6488 9.5001 9.7704 12.8666 10.9677 11.5512 11.9023 8.8830 9.0679 6.3556 6.3228 6.0927 4.7931 6.6222 8.7946 8.3008 6.0932 9.0392 11.3386 9.2610 8.4110 3.1097 3.1567 8.1034 6.1534 7.2361 7.0765 3.2245 6.5654 4.7955 5.1566 6.3647 1.8637 7.2089 6.0584 4.3494 3.1376 2.3245 3.7682 8.6445 9.5727 6.7833 8.2354 6.5812 1.6210 1.4953 6.2119 4.4054 5.0628 1.5895 1.6022 1.3914 1.3971 6.0503 6.1514 3.2483 2.8125 1.3977 1.4015 2.4628 1.8221 1.7638 1.7544 1.7952 1.1720 1.1314 1.9516 2.6437 5.1150 2.6426 3.2179 2.4616 1.4673 1.4302 1.9943 10.4842 10.3910 6.9693 7.1639 3.3686 3.4566 2.6221 2.5870 7.9362 7.4633 7.7417 7.7930 7.4828 8.2249 9.6351 1.0816 1.0882 1.0883 1.0918 1.0937 1.0941 1.0916 1.0977 1.0976 1.0643
irintensity: 0.0963 1.8618 2.6421 2.8995 2.2582 1.0976 1.7858 0.5855 1.6253 1.6129 5.1658 1.4769 4.0123 0.2828 0.6089 0.2570 1.7348 0.0726 2.1571 6.6536 0.7111 1.0500 4.0745 0.0470 0.2821 0.6526 1.0726 0.1422 2.4860 14.6110 2.1103 4.1819 45.4394 27.7682 138.7800 5.5765 0.7062 30.9286 20.3414 28.6973 32.3690 23.0267 22.6407 7.0674 25.5180 10.5457 42.1003 31.3613 2.4899 2.3795 11.5855 15.6737 26.3087 0.7801 1.1099 6.8356 3.1844 17.2479 43.0508 3.3659 0.9969 236.7657 39.6071 15.5746 39.5572 46.8596 43.9215 26.3991 119.1517 153.0768 215.6162 86.8760 57.4330 263.1869 9.8376 43.3488 122.0855 123.0384 90.0996 7.5803 6.4459 31.2238 41.4933 0.6843 0.3186 62.8833 27.1154 120.3806 124.7503 8.8274 19.1663 233.5661 1.5943 3.1471 2.3845 3.3416 8.8918 6.8519 1.0153 3.1911 3.0027 46.6644
temp: 298.150 k
press: 1.00000 atm
elementType: 8 8 8 8 8 8 8 8 7 7 6 6 6 6 6 6 6 6 6 6 6 6 6 6 6 6 1 1 1 1 1 1 1 1 1 1
symmnumber: 1
zpe: 629005.1 jmol-1
zpe.correction: 0.239575 hartree
zpe.thermalcorrener: 0.262391 hartree
zpe.thermalcorrenthalpy: 0.263335 hartree
zpe.thermalcorrgfe: 0.182786 hartree
zpe.sumelectzpe: -1324.999073 hartree
zpe.sumelectthermal: -1324.976258 hartree
zpe.sumelectthermalent: -1324.975314 hartree
zpe.sumelectthermalfe: -1325.055863 hartree
dipole: -2.1751 1.0162 1.6866
dipole: 2.9340
quadrupole: -140.0822 -167.9588 -149.5067
quadrupole: -9.5625 14.1460 -18.6724
quadrupole: 12.4337 -15.4429 3.0092 -9.5625 14.1460 -18.6724
hfenergy: -1325.2386489 hartree
pointgroup: C01 [X(C16H10N2O8)]
dipole: 0.8955099 -0.3168427 0.6558391 debye
polarizability: 279.5286046|-16.9373124|215.6587005|15.041791|1.5474018|164.8548659 unknown
InChI: InChI=1S/C16H10N2O8/c19-14(9-3-1-5-11(7-9)17(23)24)13(16(21)22)15(20)10-4-2-6-12(8-10)18(25)26/h1-8,13,21H
charge 0 multiplicity 1
36 atoms
O  0.450587 -0.554583 2.056933
O  1.886318 -3.085492 0.109977
O  -0.754404 -3.078571 -1.689875
O  -1.423653 -3.229555 0.53607
O  -5.692377 1.445306 -1.16081
O  4.161943 3.654547 -1.096377
O  -4.17195 0.170137 -2.285945
O  1.936174 3.16229 -1.177894
N  -4.574985 0.807706 -1.238904
N  3.172247 2.834403 -1.000252
C  0.119488 -1.426406 -0.197611
C  -0.306429 -0.611577 1.052177
C  1.603128 -1.875909 -0.083783
C  -1.627329 0.098987 1.028655
C  2.676812 -0.836256 -0.222466
C  -0.77205 -2.662785 -0.358864
C  -2.47009 0.108018 -0.108768
C  2.40055 0.512816 -0.544597
C  -2.031593 0.791788 2.204033
C  4.02557 -1.24397 -0.025925
C  -3.690721 0.805102 -0.040852
C  3.473021 1.416842 -0.661549
C  -3.25836 1.482737 2.24599
C  5.082188 -0.319775 -0.146575
C  -4.10576 1.496875 1.116629
C  4.815761 1.028827 -0.46842
H  0.002211 -0.812464 -1.110465
H  -2.220958 -0.405378 -1.042211
H  1.388303 0.892868 -0.70666
H  -1.363466 0.767374 3.070873
H  4.214292 -2.292975 0.223563
H  -3.558728 2.01057 3.155996
H  6.114701 -0.645971 0.010365
H  -5.064306 2.022663 1.114637
H  5.611413 1.771675 -0.57008
H  -1.278045 -3.919259 -1.792116
