program: Gaussian 09
title: 000271634
version: EM64L-G09RevD.01
frameworkgroup: C1[X(C14H7F3O3S)]
method: RPBEPBE
basis: SDD
operation: Freq
keyword: #p
keyword: freq=noraman
keyword: PBEPBE/SDD
title: #p freq=noraman PBEPBE/SDD
converged: YES YES NO NO
title: Mulliken charges:
elementType: S F F F O O O C C C C C C C C C C C C C C H H H H H H H
charge: 0.346136 -0.132638 -0.135114 -0.142613 -0.200255 -0.189622 -0.175984 0.091770 0.206178 -0.527775 0.050987 0.069268 0.111032 -0.354650 -0.207630 0.162792 0.249012 -0.204789 -0.227682 -0.135621 -0.509399 0.269770 0.266637 0.281173 0.253216 0.259213 0.253304 0.273283
chargesum: 0.00000
title: Mulliken charges with hydrogens summed into heavy atoms:
elementType: S F F F O O O C C C C C C C C C C C C C C
charge: 0.346136 -0.132638 -0.135114 -0.142613 -0.200255 -0.189622 -0.175984 0.091770 0.206178 0.008632 0.050987 0.069268 0.111032 -0.073477 0.045586 0.162792 0.249012 -0.204789 0.031531 0.117683 -0.236116
polarizability: 2.54948057e+02 -8.22152615e+00 1.49157057e+02 -5.54392731e+00 -5.35214683e+00 1.37720718e+02
1716.lowfreq: -4.2130 -0.0010 0.0009 0.0012 3.8426 5.1526 20.2062 33.8619 40.7359
frequency: 20.1472 33.8271 40.7250 44.2164 74.6152 103.0995 126.9274 139.9483 153.9025 179.0256 201.4391 215.8715 246.7128 268.8970 287.0432 305.0692 323.2957 398.1054 415.2670 433.2378 459.1868 464.6501 498.1151 520.9269 555.0082 559.5644 586.3986 615.4882 625.6496 645.8594 663.1275 687.2165 701.1770 714.8452 728.0615 748.8536 797.9148 815.2119 838.4497 840.2622 854.4980 911.8109 925.0233 930.5845 950.9654 953.6702 993.5784 1011.0208 1030.9338 1057.6971 1071.2939 1093.0307 1098.3708 1116.2668 1145.4938 1216.7503 1219.2474 1238.6048 1270.8947 1301.5282 1321.4436 1343.8475 1397.8201 1422.2991 1451.6240 1523.1836 1527.3689 1556.1231 1558.3615 1585.3346 1621.3166 2998.1387 3045.5987 3173.7691 3191.9625 3192.3907 3219.1975 3234.2492
redmass: 9.5297 8.8057 7.9237 7.9736 7.9091 7.7286 13.6081 8.6189 4.1038 5.6918 10.0470 8.6104 8.6276 9.6674 7.9351 5.0763 11.3285 7.1319 2.7621 6.2455 9.6744 11.4816 10.1118 9.5240 4.3736 4.3743 5.3983 13.0872 8.7300 9.2435 3.4162 6.4382 8.5979 2.0406 1.1896 5.7477 7.4415 6.3409 5.5218 2.7010 1.9788 2.1901 1.4179 5.6026 1.2963 2.1746 12.2370 3.0944 4.4699 4.3766 2.0741 1.2374 1.1425 2.1437 2.8339 1.8246 1.7205 3.3052 4.0226 4.4641 4.3704 2.4787 1.1927 4.8194 6.3770 6.3762 7.1218 9.9480 9.0099 11.1389 10.0877 1.0615 1.0978 1.0907 1.0891 1.0970 1.1069 1.1003
irintensity: 1.8151 1.6399 0.4644 2.7774 0.5891 1.1550 1.1749 0.8179 0.8406 0.8865 3.7482 0.3748 6.2714 3.5135 4.8395 2.0824 3.5066 2.2322 7.6013 0.0857 0.8166 4.6448 1.8001 4.1888 1.6726 6.4079 10.0301 5.1603 23.4191 0.9548 27.7461 9.3275 9.0980 36.7159 90.7213 110.2182 5.2258 23.0843 6.8656 16.5852 22.0419 4.5853 0.4073 49.8423 2.4575 27.0702 201.2758 65.6592 26.9665 217.1357 36.6836 17.9023 1.2095 89.1698 146.7825 19.7554 17.9189 14.5128 106.8348 38.7694 52.6825 6.0382 58.9544 50.8958 100.9589 18.0501 0.9250 185.0338 87.2766 148.2483 237.0183 0.6341 1.0440 4.7948 0.2422 2.6821 6.5108 0.4232
temp: 298.150 k
press: 1.00000 atm
elementType: 16 9 9 9 8 8 8 6 6 6 6 6 6 6 6 6 6 6 6 6 6 1 1 1 1 1 1 1
symmnumber: 1
zpe: 459561.2 jmol-1
zpe.correction: 0.175038 hartree
zpe.thermalcorrener: 0.193159 hartree
zpe.thermalcorrenthalpy: 0.194103 hartree
zpe.thermalcorrgfe: 0.126479 hartree
zpe.sumelectzpe: -1459.412328 hartree
zpe.sumelectthermal: -1459.394207 hartree
zpe.sumelectthermalent: -1459.393263 hartree
zpe.sumelectthermalfe: -1459.460887 hartree
dipole: -3.2168 -1.3967 4.9604
dipole: 6.0749
quadrupole: -87.7411 -138.5226 -129.0164
quadrupole: 1.2546 6.4579 -5.5062
quadrupole: 30.6856 -20.0959 -10.5897 1.2546 6.4579 -5.5062
hfenergy: -1459.5873658 hartree
pointgroup: C01 [X(C14H7F3O3S1)]
dipole: -1.2371988 0.3341663 -2.0174367 debye
polarizability: 250.7607949|21.0161449|152.3695158|10.3674637|-4.1871997|138.6955215 unknown
InChI: InChI=1S/C14H7F3O3S/c15-14(16,17)13-10(12(19)9-5-2-6-21-9)11(18)7-3-1-4-8(7)20-13/h1-3,5-6H,4H2
charge 0 multiplicity 1
28 atoms
S  4.048691 1.010372 0.773295
F  1.501096 -2.390247 0.266902
F  -0.408594 -3.423851 0.930958
F  -0.009165 -3.086238 -1.274552
O  -1.919376 -1.354605 -0.314564
O  -0.432325 2.442801 0.713827
O  1.51266 0.01015 2.2579
C  -2.719059 -0.23126 -0.319444
C  -2.287127 1.043729 0.008871
C  -4.173812 -0.2500 -0.692417
C  -0.058691 0.055033 0.438315
C  -0.904297 1.302143 0.411931
C  -0.578631 -1.161458 0.072456
C  -3.440749 1.948801 -0.132682
C  -4.536136 1.22416 -0.53571
C  1.343163 0.227702 1.022869
C  0.125946 -2.496812 0.008708
C  2.387614 0.698073 0.123736
C  2.321176 0.973266 -1.245821
C  3.561543 1.425403 -1.801083
C  4.581418 1.49797 -0.856085
H  -4.766211 -0.903289 -0.021911
H  -4.337978 -0.620601 -1.723243
H  -3.391242 3.020137 0.065375
H  -5.539736 1.609653 -0.723562
H  1.402821 0.858634 -1.827211
H  3.699784 1.688398 -2.851914
H  5.615419 1.807539 -1.002345
