program: Gaussian 09
title: 000271630
version: EM64L-G09RevD.01
frameworkgroup: C1[X(C19H16O6)]
method: RPBEPBE
basis: SDD
operation: Freq
keyword: #pfreq=noraman
keyword: PBEPBE/SDD
title: #p freq=noraman PBEPBE/SDD
converged: YES YES NO NO
title: Mulliken charges:
elementType: O O O O O O C C C C C C C C C C C C C C C C C C C H H H H H H H H H H H H H H H H
charge: -0.339604 -0.470362 -0.499552 -0.430380 -0.423122 -0.255344 0.061392 0.055411 0.243765 0.269534 0.385239 0.382911 0.158370 0.258733 -0.417417 -0.416774 -0.576623 -0.575104 0.189394 -0.571078 -0.599172 -0.839605 -0.822663 0.345671 0.343297 0.266058 0.262077 0.259596 0.265486 0.247283 0.224500 0.237061 0.245588 0.239544 0.246034 0.243019 0.237857 0.470643 0.379838 0.358585 0.359916
chargesum: 0.00000
title: Mulliken charges with hydrogens summed into heavy atoms:
elementType: O O O O O O C C C C C C C C C C C C C C C C C C C
charge: -0.339604 0.000281 -0.119714 -0.071795 -0.063206 -0.255344 0.061392 0.055411 0.243765 0.269534 0.385239 0.382911 0.158370 0.258733 -0.151359 -0.154697 -0.317027 -0.309617 0.189394 -0.323795 -0.374672 -0.117413 -0.095754 0.345671 0.343297
polarizability: 3.32398962e+02 -3.68252731e+00 2.89289932e+02 9.44670728e-01 7.45315993e+00 1.37927446e+02
1716.lowfreq: -9.8247 -2.9611 -0.0007 -0.0006 -0.0005 3.9956 33.3415 34.7420 50.4698
frequency: 33.3199 34.7189 50.4587 63.2638 79.5794 107.9985 135.4207 144.4407 166.3484 185.3463 196.2046 203.1225 208.6795 219.4824 224.5670 226.5826 236.1728 282.0146 294.3084 307.5475 315.0821 336.2747 345.6889 356.7345 371.9088 389.2915 389.8878 400.8622 495.3102 498.1151 507.8896 513.7377 533.6677 536.9233 540.7909 547.1471 562.0185 569.0719 571.7770 583.2382 610.8323 622.8140 641.1080 651.7589 699.2022 734.9983 737.5354 741.1603 790.6180 798.8539 837.5895 858.8922 864.4898 868.3541 870.7228 879.1708 894.5566 961.2656 972.2713 976.9007 979.3286 990.9535 1004.7275 1034.4296 1040.6191 1042.6547 1050.3914 1118.7334 1137.1324 1145.0104 1171.9773 1176.3832 1183.4747 1224.6006 1226.3243 1235.5317 1251.7337 1254.5354 1287.5856 1311.8508 1338.7709 1348.9334 1375.7139 1384.7377 1401.6832 1402.1604 1446.0895 1448.0593 1467.8449 1470.0565 1473.6548 1478.1584 1487.2664 1501.5079 1553.6114 1584.9549 1587.2457 1591.2225 1629.6050 1635.8255 1648.7336 2982.7556 2987.9316 3064.0284 3069.3587 3096.8893 3101.2762 3114.0384 3148.1553 3166.0196 3168.3297 3181.3400 3197.0069 3334.2078 3580.4889 3583.0010 3604.3082
redmass: 6.6927 4.6988 5.0608 8.3690 7.0725 5.1425 5.5489 1.1189 5.0504 4.5863 3.8143 4.4413 3.7335 4.2729 1.2992 4.4201 4.9596 7.8473 5.1212 4.0570 3.8420 1.8018 4.0101 1.1205 4.5796 2.1275 1.7512 2.2061 6.8797 6.4013 5.3819 4.6349 4.5711 4.9136 3.7901 3.7740 5.8875 4.8612 7.0370 7.1757 4.7652 3.2591 3.8023 4.6915 2.9029 2.9713 2.4233 1.2538 5.7813 2.0478 1.5880 1.5419 6.7336 1.3540 1.4376 2.0973 2.6808 3.0297 3.4609 5.1019 3.5019 3.1357 4.8363 1.9111 1.5660 1.5741 2.0881 1.6006 1.6405 1.4126 1.3316 1.2896 1.6171 1.3534 1.9002 2.1858 2.2053 1.7427 2.4277 6.1763 6.9822 6.1326 5.6371 6.0348 1.2171 1.2285 2.4288 2.4019 1.1836 1.3681 1.4458 1.7933 1.2747 2.4333 9.7656 8.1224 7.0394 6.7899 6.3225 6.6410 7.9892 1.0398 1.0393 1.0939 1.0944 1.0999 1.1001 1.0920 1.0922 1.0924 1.0925 1.0927 1.0920 1.0677 1.0660 1.0662 1.0661
irintensity: 0.0721 0.7495 0.8969 0.4044 0.9408 1.3667 1.3840 0.5148 9.3256 1.7042 5.0910 1.9360 0.3902 3.9350 0.2000 2.1727 1.1339 1.6444 2.1224 19.8604 20.8627 62.9697 5.9039 128.9038 0.3503 53.1139 102.1503 37.4561 1.9153 0.9146 5.8250 5.8586 6.3915 19.7087 2.9369 7.4418 0.6071 1.0310 4.2798 16.3647 12.5258 0.7129 11.6482 16.3042 4.5608 10.1774 33.6150 123.1159 9.8669 38.9810 6.2460 38.4205 41.0121 13.4223 12.8553 27.6184 23.8132 31.6094 13.2194 43.4080 18.9680 20.9074 20.4352 200.9413 4.4895 6.9427 28.6804 521.3723 206.5566 66.9499 71.7460 1.7722 95.8179 9.8673 25.2964 29.6163 16.2907 19.6609 57.5267 414.1592 85.5306 24.0440 60.2214 0.6523 6.8279 24.7510 16.1152 23.1168 14.7656 28.3353 7.5169 27.0398 65.6381 26.4350 164.4651 318.9894 104.1840 71.5925 393.0640 50.9593 453.1252 18.3909 14.3219 18.1740 15.1071 18.3254 17.2749 9.9010 7.4264 4.7039 3.2060 4.0279 2.1273 671.5187 61.1076 61.3676 49.5247
temp: 298.150 k
press: 1.00000 atm
elementType: 8 8 8 8 8 8 6 6 6 6 6 6 6 6 6 6 6 6 6 6 6 6 6 6 6 1 1 1 1 1 1 1 1 1 1 1 1 1 1 1 1
symmnumber: 1
zpe: 803179.0 jmol-1
zpe.correction: 0.305915 hartree
zpe.thermalcorrener: 0.328598 hartree
zpe.thermalcorrenthalpy: 0.329542 hartree
zpe.thermalcorrgfe: 0.255047 hartree
zpe.sumelectzpe: -1183.175826 hartree
zpe.sumelectthermal: -1183.153143 hartree
zpe.sumelectthermalent: -1183.152199 hartree
zpe.sumelectthermalfe: -1183.226695 hartree
dipole: -3.0288 -6.8345 0.2450
dipole: 7.4796
quadrupole: -134.2374 -143.7991 -146.9186
quadrupole: 7.2327 4.1101 19.4317
quadrupole: 7.4143 -2.1474 -5.2669 7.2327 4.1101 19.4317
hfenergy: -1183.4817411 hartree
pointgroup: C01 [X(C19H16O6)]
dipole: 1.1274645 -2.3295092 1.400573 debye
polarizability: 332.5501084|2.5859865|237.3036308|-0.8888802|-72.1607019|189.7626009 unknown
InChI: InChI=1S/C19H16O6/c1-9-3-11(20)5-14(23)18(9)16-7-13(22)8-17(25-16)19-10(2)4-12(21)6-15(19)24/h3-8,20-21,23-24H,1-2H3
charge 0 multiplicity 1
41 atoms
O  0.032016 0.190972 -0.245603
O  -1.238869 -1.09464 1.794536
O  1.396794 -0.520718 2.012293
O  -5.764078 -2.360401 0.739642
O  5.731989 -2.498574 0.803163
O  0.075006 4.17468 -1.418954
C  -2.358573 0.014358 -0.151438
C  2.423392 -0.005022 -0.109786
C  -1.199063 0.882443 -0.422275
C  1.26394 0.867983 -0.403856
C  -3.557869 0.087707 -0.944378
C  3.513203 -0.164734 -1.025347
C  -2.31959 -0.921648 0.943165
C  2.472888 -0.714248 1.122583
C  -1.183827 2.209517 -0.790375
C  1.290363 2.181955 -0.794354
C  -4.664656 -0.720944 -0.618811
C  4.595162 -1.004798 -0.680841
C  0.058253 2.952003 -1.043344
C  -3.444856 -1.713899 1.260162
C  3.550239 -1.552888 1.470042
C  -3.689239 0.991341 -2.16166
C  3.544731 0.532363 -2.374835
C  -4.612421 -1.602627 0.484001
C  4.61754 -1.688355 0.55279
H  -2.122958 2.758411 -0.876772
H  2.246615 2.700954 -0.894645
H  -5.577671 -0.684618 -1.219476
H  5.431293 -1.147481 -1.370901
H  -3.367631 -2.399934 2.110775
H  3.556081 -2.086823 2.429784
H  -4.02278 2.008897 -1.882233
H  -2.738108 1.102058 -2.709057
H  -4.443651 0.582865 -2.854895
H  2.540706 0.616034 -2.823173
H  3.943366 1.560726 -2.288225
H  4.197078 -0.014494 -3.075796
H  -0.377697 -0.690676 1.477948
H  1.539215 -0.981467 2.874522
H  -5.634969 -2.944077 1.528188
H  5.666036 -2.949304 1.681336
