program: Gaussian 09
title: 000271620
version: EM64L-G09RevD.01
frameworkgroup: C1[X(C16H16N4O4)]
method: RPBEPBE
basis: SDD
operation: Freq
keyword: #p
keyword: freq=noraman
keyword: PBEPBE/SDD
title: #p freq=noraman PBEPBE/SDD
converged: YES YES NO NO
title: Mulliken charges:
elementType: O O O O N N N N C C C C C C C C C C C C C C C C H H H H H H H H H H H H H H H H
charge: -0.188970 -0.272980 -0.212773 -0.207654 -0.013601 -0.433801 0.023194 0.015642 -0.555884 -0.516524 0.509349 0.195390 -0.396182 -0.414717 0.302546 -0.804731 0.260851 -0.292749 -0.226516 -0.220381 -0.498213 0.445764 -0.368807 -0.239232 0.228321 0.211413 0.220508 0.247719 0.229416 0.221937 0.255510 0.250858 0.252964 0.376991 0.301500 0.227183 0.227881 0.335205 0.291992 0.231584
chargesum: 0.00000
title: Mulliken charges with hydrogens summed into heavy atoms:
elementType: O O O O N N N N C C C C C C C C C C C C C C C C
charge: -0.188970 -0.272980 -0.212773 -0.207654 -0.013601 -0.056810 0.023194 0.015642 -0.116151 -0.048297 0.509349 0.195390 -0.166766 -0.192780 0.302546 -0.045399 0.260851 0.008751 0.000667 0.007500 -0.163008 0.445764 -0.076816 -0.007648
polarizability: 3.31505212e+02 -4.99821009e+01 2.53253431e+02 4.39761020e+01 2.66129906e+01 1.74781029e+02
1716.lowfreq: -12.2467 -6.9414 -1.9221 -0.0004 0.0002 0.0007 1.2305 17.2434 18.4104
frequency: -10.2027 17.2424 18.0728 43.9989 51.8735 60.5692 62.8829 76.8858 116.0229 128.8721 146.2889 155.9852 164.8326 187.8235 227.7199 250.0426 273.2253 320.3914 323.3097 343.7078 363.1258 386.2762 402.2902 407.4051 437.8799 455.2778 487.6988 504.5124 514.9411 528.7489 548.0928 581.7932 610.9574 617.6177 645.4537 652.1191 675.3572 704.7301 706.0855 725.5718 749.1581 753.2257 764.0559 778.0468 812.0973 849.7114 852.5182 863.3232 890.4511 896.6029 923.8843 930.0845 962.6537 975.5458 989.8305 993.5528 994.2922 997.1550 1010.9870 1020.2477 1027.7537 1046.1994 1060.8433 1090.0099 1100.4908 1136.6910 1152.7972 1167.5317 1173.1543 1187.3127 1191.1384 1212.1829 1219.9207 1233.0561 1269.6150 1302.3740 1306.9392 1330.7988 1333.9533 1344.9037 1360.6810 1382.7611 1386.6481 1387.3913 1440.3953 1447.3538 1449.3628 1458.3888 1467.6017 1478.2028 1483.9633 1484.7143 1518.3333 1576.0798 1588.0464 1594.0287 1614.8450 1623.7280 2967.5346 2974.6498 2992.0278 3040.1253 3043.6580 3073.0663 3105.5038 3111.8950 3113.5819 3132.7701 3144.7559 3163.9711 3180.5462 3188.8685 3201.3443 3240.5547
redmass: 4.4550 6.7144 5.2517 6.3925 4.5934 8.4242 5.4659 7.2142 4.4498 1.2640 5.0111 9.1555 5.1670 3.4289 4.7201 4.1587 5.5634 6.8913 5.1285 2.2525 4.9963 4.8543 2.8450 4.4555 3.8300 4.9714 4.0262 8.2761 3.5250 3.9243 3.8818 2.6753 5.5219 6.3195 5.9800 7.8311 9.7599 1.8048 7.5739 4.8432 2.6316 11.0769 2.3629 3.1680 1.1850 4.0619 1.2530 1.4259 5.5114 1.6775 2.0405 1.6638 1.4074 1.3911 5.3056 1.9722 2.5726 1.6065 1.3168 1.7218 2.0884 2.1810 2.0931 1.7960 3.9454 1.3527 1.3603 5.9534 1.0636 1.1108 1.4258 4.7489 1.7479 1.8958 2.8087 1.8937 1.5252 1.3262 2.0689 2.6611 6.2667 6.5392 3.9023 1.2723 2.1208 4.2104 1.1796 1.2958 1.0953 1.1864 2.1765 2.0906 3.3561 5.2937 6.3067 6.0526 6.1960 7.2620 1.0400 1.0634 1.0608 1.0974 1.1018 1.0969 1.0964 1.0883 1.0871 1.0898 1.0954 1.1014 1.0895 1.0919 1.0962 1.0786
irintensity: 0.0137 0.5081 0.1964 1.0528 0.1694 0.5271 0.2695 0.7026 2.1618 4.7137 0.4916 1.6810 2.6989 4.0574 0.5670 5.7649 0.5180 1.4740 0.0673 0.3586 0.1772 0.8263 0.0412 1.7863 0.0545 2.6818 12.3275 5.5800 12.6303 8.0484 3.2542 19.8312 4.1301 0.0879 2.2625 16.6373 9.8621 56.4740 6.1153 1.1660 35.3865 5.1463 15.3887 14.6639 87.2648 6.1597 0.4840 22.8911 5.6471 0.0357 3.1379 12.9325 23.8418 0.4860 1.2808 14.9785 3.3396 0.0594 0.0340 6.9964 2.8294 2.6450 42.3854 36.4798 57.4384 42.3387 43.0911 337.7108 3.4177 1.7103 1.7271 406.9888 2.7123 140.3738 30.9166 68.2576 24.0573 18.5391 107.3915 121.9544 57.1101 3.2662 24.7384 44.9185 10.3362 2.6965 18.5295 16.9080 17.1674 11.6048 88.4471 11.7947 80.2365 45.8061 100.7936 1.7518 7.1556 411.3805 7.7107 20.6370 65.2687 10.8336 15.5131 17.1224 20.8368 10.6278 12.0166 6.5697 36.9372 17.4930 3.1689 19.7968 0.0531 65.7739
temp: 298.150 k
press: 1.00000 atm
elementType: 8 8 8 8 7 7 7 7 6 6 6 6 6 6 6 6 6 6 6 6 6 6 6 6 1 1 1 1 1 1 1 1 1 1 1 1 1 1 1 1
symmnumber: 1
zpe: 790959.8 jmol-1
zpe.correction: 0.301261 hartree
zpe.thermalcorrener: 0.322137 hartree
zpe.thermalcorrenthalpy: 0.323081 hartree
zpe.thermalcorrgfe: 0.248687 hartree
zpe.sumelectzpe: -1137.299369 hartree
zpe.sumelectthermal: -1137.278493 hartree
zpe.sumelectthermalent: -1137.277549 hartree
zpe.sumelectthermalfe: -1137.351942 hartree
dipole: -8.9201 1.2983 -2.3919
dipole: 9.3261
quadrupole: -171.3737 -144.9872 -135.2899
quadrupole: 0.9038 0.7794 -7.7843
quadrupole: -20.8234 5.5631 15.2604 0.9038 0.7794 -7.7843
hfenergy: -1137.6006294 hartree
pointgroup: C01 [X(C16H16N4O4)]
dipole: 3.5884224 0.4520759 0.6177422 debye
polarizability: 340.5802184|47.4074152|243.5723638|25.5567441|-38.5869109|175.38709 unknown
InChI: InChI=1S/C16H16N4O4/c1-12(7-8-13-5-3-2-4-6-13)17-18-15-10-9-14(19(21)22)11-16(15)20(23)24/h2-6,9-11,18H,7-8H2,1H3
charge 0 multiplicity 1
40 atoms
O  -3.528122 2.745601 -1.514212
O  -1.31005 3.04588 -1.092408
O  -4.942443 -2.562471 1.524796
O  -5.98127 -1.004305 0.214227
N  1.109403 0.852926 1.055136
N  -0.022487 1.345691 0.399272
N  -2.43067 2.364521 -0.960382
N  -4.941091 -1.476691 0.81928
C  4.581797 0.573687 0.632981
C  3.444659 1.007737 1.618661
C  4.190527 -0.600446 -0.253485
C  2.219782 1.556872 0.921424
C  4.144976 -1.916409 0.276142
C  3.842499 -0.407601 -1.614253
C  -1.21413 0.667575 0.494791
C  2.332175 2.843497 0.122756
C  -2.413511 1.142876 -0.15997
C  -1.308116 -0.546262 1.254525
C  3.759953 -3.009524 -0.530635
C  3.454156 -1.498303 -2.426374
C  -3.632577 0.437778 -0.050496
C  -3.671157 -0.739301 0.703929
C  -2.509246 -1.239537 1.360071
C  3.410948 -2.80372 -1.886242
H  5.462467 0.309562 1.249464
H  4.879426 1.438401 0.010161
H  3.854461 1.784508 2.296545
H  3.139495 0.144777 2.235269
H  4.418993 -2.086216 1.325424
H  3.885194 0.601178 -2.045331
H  2.134964 2.673597 -0.954667
H  3.339398 3.278221 0.214368
H  1.605303 3.604478 0.469563
H  -0.044942 2.206234 -0.183875
H  -0.397883 -0.901784 1.740144
H  3.735725 -4.019858 -0.106779
H  3.191305 -1.330606 -3.476975
H  -4.527947 0.814106 -0.551575
H  -2.585089 -2.165329 1.93617
H  3.113624 -3.651039 -2.513941
