program: Gaussian 09
title: 000271608
version: EM64L-G09RevD.01
frameworkgroup: C1[X(C11H15NO3)]
method: RPBEPBE
basis: SDD
operation: Freq
keyword: #p
keyword: freq=noraman
keyword: PBEPBE/SDD
title: #p freq=noraman PBEPBE/SDD
converged: YES YES NO NO
title: Mulliken charges:
elementType: O O O N C C C C C C C C C C C H H H H H H H H H H H H H H H
charge: -0.245841 -0.216483 -0.218776 -0.141072 0.186288 0.184663 -0.188892 -0.190654 -0.452522 -0.451334 0.127806 0.127812 -0.771826 -0.772230 -0.603567 0.282019 0.282774 0.242081 0.214558 0.215084 0.242082 0.222425 0.252590 0.216942 0.222804 0.216977 0.252429 0.247192 0.256366 0.260305
chargesum: 0.00000
title: Mulliken charges with hydrogens summed into heavy atoms:
elementType: O O O N C C C C C C C C C C C
charge: -0.245841 -0.216483 -0.218776 -0.141072 0.186288 0.184663 0.093128 0.092120 0.004117 0.005832 0.127806 0.127812 -0.079869 -0.080019 0.160296
polarizability: 1.34035682e+02 8.83952428e-01 1.33857729e+02 3.06154813e+00 1.78877159e-01 1.00898377e+02
1716.lowfreq: -17.1467 -0.0004 -0.0003 0.0003 7.5573 13.4699 58.3871 61.4934 95.4942
frequency: 58.3825 61.4545 95.4817 149.1699 154.4553 188.6170 228.6874 243.0137 258.3687 271.3607 275.6566 297.7801 307.6848 311.9728 329.6289 398.7835 491.3228 519.8600 526.6558 561.5144 587.2799 648.4507 702.4622 708.0492 765.3336 770.0412 791.6917 820.9297 830.1867 873.2086 894.3795 910.1189 932.4073 944.8924 975.0879 999.4838 1015.7493 1023.4482 1048.7807 1080.4052 1110.0145 1127.0333 1135.2295 1148.0476 1171.0870 1190.4570 1196.6178 1204.8628 1217.8759 1231.6476 1260.3928 1277.9514 1284.8883 1286.1006 1305.6232 1353.1122 1386.7880 1400.1412 1431.8613 1455.9204 1467.9584 1470.1687 1475.5305 1480.8889 1481.6238 1482.4876 1497.1586 1617.9130 1686.8896 2991.9519 2995.0797 3005.9057 3029.1780 3041.2805 3080.1410 3083.7275 3085.9856 3095.9686 3098.5481 3099.8450 3104.1802 3110.1390 3117.2666 3124.4697
redmass: 1.4546 1.9849 3.6028 3.5271 7.8802 1.0795 1.2677 2.6812 2.3960 3.3203 2.8375 2.7658 2.2463 3.4801 4.3322 4.3904 4.4516 4.4718 7.7786 3.5038 8.4172 4.2780 6.4395 5.8833 5.4869 4.2634 2.1239 2.0260 2.8987 2.2437 2.8708 3.8196 2.4891 2.1423 2.3955 3.2254 1.5273 2.2859 2.1155 1.6658 2.6933 1.4031 2.1101 1.7822 2.2017 2.7927 1.2710 1.7310 1.5863 2.0016 1.9171 2.3858 1.7446 1.7233 1.4152 5.2426 1.2000 1.1961 1.2912 1.0626 1.0580 1.0450 1.0761 1.0655 1.0655 1.0535 1.0694 11.3693 10.8493 1.0359 1.0360 1.0325 1.0590 1.0623 1.1021 1.1014 1.0989 1.1001 1.1016 1.1021 1.1022 1.0886 1.0945 1.1024
irintensity: 0.1895 0.2006 8.1271 0.0620 4.3042 0.0129 0.5093 0.5572 0.4291 4.5503 1.7175 0.0497 0.1065 4.2722 8.7768 19.3245 0.1056 10.3723 18.0753 0.1362 3.9421 2.2433 0.7410 2.1004 7.8785 0.3408 5.6493 12.1317 7.4919 19.9392 0.5400 4.0821 11.3216 24.6942 21.6053 35.6325 4.8161 1.4963 85.1029 1.8685 5.8646 0.4359 0.5062 11.0176 0.8489 33.6145 4.3920 12.5911 1.7804 1.1712 12.9849 63.0585 9.2614 5.2728 1.3011 113.3884 18.5791 22.4286 82.2351 15.1173 0.6292 17.7246 7.6934 4.5900 7.2293 21.1313 25.7900 513.7573 23.3723 4.2105 33.8996 24.7588 26.2788 36.1167 0.9424 7.7167 35.7291 7.2978 23.5915 16.5317 28.5898 21.6703 7.7023 1.0455
temp: 298.150 k
press: 1.00000 atm
elementType: 8 8 8 7 6 6 6 6 6 6 6 6 6 6 6 1 1 1 1 1 1 1 1 1 1 1 1 1 1 1
symmnumber: 1
zpe: 645697.4 jmol-1
zpe.correction: 0.245933 hartree
zpe.thermalcorrener: 0.259871 hartree
zpe.thermalcorrenthalpy: 0.260815 hartree
zpe.thermalcorrgfe: 0.206145 hartree
zpe.sumelectzpe: -707.474798 hartree
zpe.sumelectthermal: -707.460861 hartree
zpe.sumelectthermalent: -707.459916 hartree
zpe.sumelectthermalfe: -707.514586 hartree
dipole: 2.6732 0.0265 2.2377
dipole: 3.4863
quadrupole: -80.1557 -101.2772 -89.3680
quadrupole: -0.1139 1.4351 -0.0251
quadrupole: 10.1113 -11.0102 0.8989 -0.1139 1.4351 -0.0251
hfenergy: -707.7207312 hartree
pointgroup: C01 [X(C11H15N1O3)]
dipole: -1.0167915 0.0201335 -0.9203464 debye
polarizability: 133.7511925|-0.9298931|133.8550539|4.3262969|0.1964403|101.1855421 unknown
InChI: InChI=1S/C11H15NO3/c1-10-6-4-5-7(15-6)11(10,2)9(14)12(3)8(10)13/h6-7H,4-5H2,1-3H3
charge 0 multiplicity 1
30 atoms
O  -0.935306 -0.030157 1.648449
O  1.605635 -2.336722 0.098453
O  1.590002 2.339188 0.157738
N  1.892722 -0.000884 0.188054
C  -0.270733 -0.790653 -0.502455
C  -0.274924 0.796308 -0.479719
C  -1.259892 -1.122329 0.676811
C  -1.265207 1.088459 0.709506
C  -2.730334 -0.80037 0.301096
C  -2.734213 0.7706 0.324174
C  1.151157 -1.175185 -0.045036
C  1.144808 1.178057 -0.013648
C  -0.576811 -1.497363 -1.835462
C  -0.587211 1.539819 -1.79135
C  3.280851 -0.008175 0.663679
H  -1.079016 -2.095592 1.153506
H  -1.088914 2.047904 1.214952
H  -3.403241 -1.210568 1.072014
H  -3.033424 -1.223383 -0.670722
H  -3.03895 1.220011 -0.63506
H  -3.409438 1.154668 1.10643
H  0.16332 -1.225857 -2.609144
H  -0.526639 -2.591828 -1.698589
H  -1.575846 -1.23509 -2.221421
H  0.160613 1.305182 -2.569629
H  -1.579891 1.272625 -2.189874
H  -0.556182 2.630117 -1.620377
H  3.920835 -0.566108 -0.039741
H  3.340766 -0.492724 1.652655
H  3.615862 1.038551 0.737213
