program: Gaussian 09
title: 000271581
version: EM64L-G09RevD.01
frameworkgroup: C1[X(C22H21NO)]
method: RPBEPBE
basis: SDD
operation: Freq
keyword: #p
keyword: freq=noraman
keyword: PBEPBE/SDD
title: #p freq=noraman PBEPBE/SDD
converged: YES YES NO NO
title: Mulliken charges:
elementType: O N C C C C C C C C C C C C C C C C C C C C C C H H H H H H H H H H H H H H H H H H H H H
charge: -0.285206 -0.060454 -0.506343 0.537945 0.438684 0.157924 -0.340576 -0.423602 -0.470312 -0.366747 -0.241437 -0.226209 -0.227626 -0.238216 0.151319 -0.245782 -0.244709 -0.379843 -0.302177 0.445532 -0.337726 -0.416336 -0.527947 -0.811718 0.221665 0.244402 0.235008 0.220514 0.263151 0.222408 0.226058 0.222617 0.227934 0.225483 0.229157 0.255015 0.285620 0.226770 0.223967 0.219266 0.249962 0.241225 0.223205 0.230051 0.228083
chargesum: 0.00000
title: Mulliken charges with hydrogens summed into heavy atoms:
elementType: O N C C C C C C C C C C C C C C C C C C C C C C
charge: -0.285206 -0.060454 -0.284677 0.537945 0.438684 0.157924 -0.096174 -0.188595 -0.249798 -0.103597 -0.019028 -0.000152 -0.005010 -0.010282 0.151319 -0.020298 -0.015552 -0.124828 -0.016557 0.445532 -0.110956 -0.192369 0.182506 -0.130379
polarizability: 3.16681226e+02 -8.47032817e+00 2.44442766e+02 2.65689424e+01 -6.86032070e+00 2.05652577e+02
1716.lowfreq: -4.5533 -3.3920 -0.0005 -0.0003 0.0006 9.0301 20.6756 24.6749 29.3155
frequency: 20.4866 24.5607 29.2825 34.0811 38.6343 48.1344 55.7702 61.2746 102.5377 110.3369 122.2035 190.8523 193.3041 204.0884 211.8077 226.4586 248.4504 279.9770 282.9929 362.9210 370.1075 386.0535 402.6906 403.0611 416.3652 467.3245 487.0871 504.8841 520.5887 578.5667 610.2315 616.5012 621.3101 637.9357 643.4076 685.9684 699.1051 706.2945 708.5860 730.1697 752.7186 757.7696 801.5139 830.0988 842.5302 844.1372 849.3091 851.3691 858.2937 880.2966 923.3979 930.2618 967.7128 969.2282 980.7219 981.7956 982.6628 989.4250 989.5597 991.7644 995.3248 998.5769 1010.5991 1026.9352 1027.9826 1045.6429 1055.6731 1080.2067 1086.2284 1099.5051 1116.2687 1144.7182 1170.2474 1172.3524 1177.4040 1183.2210 1189.1014 1191.3775 1203.7363 1220.7286 1227.3899 1249.1256 1284.2135 1302.5238 1331.7120 1337.5452 1354.3181 1380.7618 1387.7253 1395.8518 1412.0380 1429.0540 1439.1686 1441.1406 1468.4905 1470.4285 1471.8007 1473.1053 1480.2426 1482.7715 1495.9275 1563.3014 1591.5445 1595.7056 1609.1076 1613.0320 1615.5593 1669.1284 2972.9247 2974.8234 2992.7484 3049.6075 3075.3417 3081.7045 3106.8866 3115.0645 3117.4975 3117.7277 3120.6479 3123.7179 3125.7898 3136.9739 3137.2466 3147.5405 3152.9922 3159.4292 3163.5648 3165.2930 3192.7253
redmass: 4.4957 3.9391 2.8724 3.7121 1.2262 4.8009 3.7523 4.5552 4.2204 2.9213 4.4274 4.1480 1.1871 4.4537 4.3763 4.5234 4.6010 4.1347 4.4503 3.4959 3.9858 4.6238 2.7891 2.8402 2.9476 4.1873 4.3482 3.5975 3.2712 4.8732 5.8498 6.4352 6.4680 5.5349 5.6917 7.5196 1.7432 1.8492 4.8195 2.8985 1.8664 2.2394 4.8770 3.5707 1.5184 1.2879 1.2645 3.8528 1.3015 2.9191 1.8868 1.4745 1.3883 1.3552 1.8030 1.3920 1.3957 1.5343 4.7222 3.7227 4.0418 1.3498 2.7885 2.3588 2.1705 1.5536 3.2770 1.6376 1.5983 1.2518 1.2990 1.4779 1.0645 1.0744 2.1154 1.3202 1.1429 1.1184 2.1029 2.2487 5.5708 1.6537 1.4931 1.3298 1.2775 1.2862 4.6360 7.7089 6.6415 1.2364 3.4063 1.1504 2.1898 2.0912 1.0618 1.0467 1.0581 1.1153 2.1924 2.2867 2.6083 5.8294 6.1056 6.0725 6.0164 6.2122 6.3409 10.8277 1.0372 1.0318 1.0809 1.0975 1.1037 1.0985 1.0879 1.0875 1.0932 1.0981 1.0899 1.0862 1.0862 1.0920 1.0916 1.0959 1.0959 1.0954 1.1014 1.0997 1.0935
irintensity: 0.0193 0.0361 0.2490 0.0148 0.6101 0.4603 1.9835 0.7307 0.2846 5.2631 1.6975 2.5514 1.4971 0.3440 0.1599 1.0675 0.3099 1.4652 0.9394 3.0802 3.8891 5.2983 0.3629 0.1258 0.1849 2.4552 7.3565 7.9416 28.9277 3.8064 1.8571 0.9621 5.6545 25.2521 2.6802 3.4742 47.4557 49.6682 8.4988 2.9858 28.7451 52.8635 1.1821 2.1341 49.8936 6.2228 2.2246 14.5724 0.8328 4.9500 1.1278 0.2390 1.2604 3.6281 5.6175 0.8982 0.8764 1.1800 8.4467 0.6186 54.9842 3.1724 4.2082 12.4377 10.1364 12.1440 197.8463 13.1028 13.9202 0.0939 5.3077 52.0364 0.4480 0.1347 1.8196 3.3513 2.3672 2.3638 0.5781 1.3661 2.2998 0.4608 19.8163 2.3073 2.0683 11.8645 10.7360 0.4145 0.3939 6.0030 1.2821 5.2863 14.3247 9.2996 15.2713 12.2677 10.9649 9.6190 32.0595 15.6115 63.8763 9.1623 2.5816 0.5174 17.6078 14.0593 6.1332 266.1420 60.7353 50.9956 20.8102 22.3877 26.3586 19.8432 10.8784 6.8386 6.6095 35.6637 33.7425 0.3189 0.0328 16.3209 24.9092 27.6275 43.6652 9.2518 30.2858 11.1158 1.9284
temp: 298.150 k
press: 1.00000 atm
elementType: 8 7 6 6 6 6 6 6 6 6 6 6 6 6 6 6 6 6 6 6 6 6 6 6 1 1 1 1 1 1 1 1 1 1 1 1 1 1 1 1 1 1 1 1 1
symmnumber: 1
zpe: 957118.7 jmol-1
zpe.correction: 0.364547 hartree
zpe.thermalcorrener: 0.386633 hartree
zpe.thermalcorrenthalpy: 0.387577 hartree
zpe.thermalcorrgfe: 0.309522 hartree
zpe.sumelectzpe: -979.205858 hartree
zpe.sumelectthermal: -979.183772 hartree
zpe.sumelectthermalent: -979.182828 hartree
zpe.sumelectthermalfe: -979.260883 hartree
dipole: 1.4053 -1.6453 1.2944
dipole: 2.5214
quadrupole: -128.9106 -132.1203 -128.3839
quadrupole: -2.4009 6.7583 -3.7278
quadrupole: 0.8944 -2.3154 1.4210 -2.4009 6.7583 -3.7278
hfenergy: -979.5704049 hartree
pointgroup: C01 [X(C22H21N1O1)]
dipole: 0.4985361 0.6665777 -0.5396185 debye
polarizability: 312.5657466|10.5885798|245.1423794|-32.4915075|-8.4943328|209.0684439 unknown
InChI: InChI=1S/C22H21NO/c1-17-13-15-20(16-14-17)23-22(24-2)21(18-9-5-3-6-10-18)19-11-7-4-8-12-19/h3-16,21H,1-2H3
charge 0 multiplicity 1
45 atoms
O  -0.667851 1.47373 -1.78817
N  -0.993454 -0.228946 -0.173174
C  1.313936 0.125363 -0.98347
C  1.638733 -1.319337 -0.5796
C  2.094881 1.162506 -0.149152
C  -0.195623 0.416869 -0.957856
C  1.631085 -1.733375 0.774836
C  3.439274 1.456383 -0.494759
C  1.961107 -2.265907 -1.582392
C  1.521982 1.808953 0.974446
C  1.937732 -3.067589 1.116657
C  4.196698 2.37445 0.264433
C  2.266455 -3.604455 -1.24398
C  2.278193 2.73041 1.73456
C  -2.390308 -0.082848 0.022998
C  2.256541 -4.00932 0.109424
C  3.61682 3.016918 1.383893
C  -2.972424 -1.022803 0.92179
C  -3.241585 0.896338 -0.570657
C  -5.200338 -0.019394 0.629606
C  -4.346911 -0.992489 1.216607
C  -4.619238 0.916901 -0.261987
C  0.231715 2.177866 -2.722167
C  -6.684972 0.007324 0.94911
H  1.653641 0.235249 -2.032185
H  1.381492 -1.01201 1.558871
H  3.89762 0.951928 -1.354905
H  1.968005 -1.958196 -2.636385
H  0.484695 1.591633 1.253077
H  1.928115 -3.375124 2.168641
H  5.234709 2.588524 -0.014481
H  2.512067 -4.325199 -2.032246
H  1.820904 3.223912 2.599658
H  2.495627 -5.044837 0.377183
H  4.201627 3.731642 1.973651
H  -2.310384 -1.770873 1.369835
H  -2.81776 1.625334 -1.263776
H  -4.768144 -1.73075 1.910495
H  -5.258067 1.678181 -0.727364
H  0.543326 1.514831 -3.550959
H  1.116661 2.586119 -2.202852
H  -0.375315 3.002973 -3.124987
H  -7.193219 0.845952 0.442579
H  -7.181678 -0.928908 0.630009
H  -6.861767 0.112273 2.036343
