program: Gaussian 09
title: 000271576
version: EM64L-G09RevD.01
frameworkgroup: C1[X(C12H16N4O3)]
method: RPBEPBE
basis: SDD
operation: Freq
keyword: #p
keyword: freq=noraman
keyword: PBEPBE/SDD
title: #p freq=noraman PBEPBE/SDD
converged: YES YES NO NO
title: Mulliken charges:
elementType: O O O N N N N C C C C C C C C C C C C H H H H H H H H H H H H H H H H
charge: -0.265181 -0.324185 -0.234715 -0.357020 0.044447 -0.417940 -0.372066 -0.389704 -0.499122 -0.385541 0.025142 0.113314 0.374674 0.241763 -0.443939 -0.380604 0.190400 -0.210821 -0.677828 0.231462 0.204187 0.215568 0.230252 0.220279 0.215917 0.325156 0.285845 0.310693 0.260615 0.342095 0.230445 0.228998 0.215102 0.225804 0.226506
chargesum: 0.00000
title: Mulliken charges with hydrogens summed into heavy atoms:
elementType: O O O N N N N C C C C C C C C C C C C
charge: -0.265181 -0.324185 -0.234715 -0.031864 0.044447 -0.132095 -0.029971 0.045944 -0.053301 0.050655 0.025142 0.113314 0.374674 0.241763 -0.133246 -0.119989 0.190400 0.248623 -0.010416
polarizability: 3.34715091e+02 -9.48264966e-01 1.73954577e+02 -2.59578703e+00 -2.06163843e+00 9.16282019e+01
1716.lowfreq: -13.3734 -5.6389 -0.0007 -0.0002 0.0006 3.9387 13.5111 24.4105 38.7829
frequency: 9.9125 24.2909 38.7175 45.9575 60.4731 93.6423 101.6325 114.4508 137.0455 154.2048 176.5662 226.6353 231.1905 256.0572 270.8861 294.4594 334.8873 346.5846 378.5434 399.2283 432.6382 462.8251 489.8423 505.9192 552.0343 560.3812 586.0399 594.0811 628.3793 631.9295 637.5642 684.3847 714.3376 720.0995 747.9695 759.6238 797.6320 805.8964 837.2051 866.8993 869.4016 895.7814 931.3242 941.9433 977.7315 1005.0438 1026.5617 1049.4880 1070.3157 1107.7965 1111.1742 1129.2228 1137.8080 1139.1099 1173.0021 1184.1513 1189.1543 1207.6372 1247.6634 1251.2812 1267.4297 1315.5498 1320.1569 1340.9495 1350.3490 1362.7581 1372.7138 1398.3581 1404.9283 1413.1913 1427.2454 1455.5725 1464.9997 1465.2820 1475.4128 1487.6003 1488.8506 1496.6650 1511.7060 1541.0551 1595.9040 1621.6871 1653.9426 2923.6619 2939.1414 2965.6055 2993.4852 3005.5695 3009.3155 3041.7779 3066.1617 3069.0935 3090.4331 3103.9524 3227.9789 3256.0062 3420.3044 3540.4004 3605.2874
redmass: 2.8460 4.8903 5.3126 3.8399 2.9379 4.6483 3.9998 4.3559 3.8916 4.7037 4.0742 5.1112 4.2597 1.3401 6.2587 1.8802 3.9370 4.6638 5.4760 1.9255 4.4018 4.0440 5.4873 5.3825 4.6903 1.4796 1.7408 4.3704 2.2950 1.1994 2.3610 6.0804 4.0555 5.8913 1.8054 7.3831 1.1008 4.5589 3.7000 1.4335 1.5323 2.5172 2.1090 4.4002 3.3709 2.4939 2.2965 3.6626 1.7688 1.9729 2.1675 1.3338 1.4725 3.1669 2.9875 1.2546 1.8382 2.6342 1.1314 1.7887 1.1833 2.0901 2.0642 1.6915 1.4577 1.5253 1.7026 1.3047 3.3478 2.2606 3.3293 1.1109 1.0409 1.1095 1.0535 1.0929 1.1047 1.9906 5.1546 5.8643 5.2732 5.6632 10.4473 1.0580 1.0693 1.0988 1.0356 1.0624 1.0582 1.0925 1.1063 1.1043 1.0985 1.1028 1.0982 1.0993 1.0740 1.0769 1.0815
irintensity: 0.0273 2.9047 1.8614 1.9070 1.2462 0.0534 0.1011 2.5414 0.8298 0.8410 3.0012 11.0119 6.4440 0.0814 1.5585 8.0031 2.4433 3.3609 11.9871 16.4083 6.8415 8.6632 0.4698 13.6317 1.6671 120.6981 26.9769 19.7313 24.3892 64.8462 2.1735 1.3162 15.6153 40.9669 38.4173 18.0439 2.8859 12.8194 17.9036 41.5475 26.5158 14.2028 20.0438 226.3280 18.7427 37.8780 16.2818 365.5971 2.1983 146.7946 4.2205 70.9525 6.0344 235.0641 20.8721 0.3549 162.1820 1.9177 0.0229 17.6564 9.1880 513.1706 101.4281 7.7730 5.3091 24.9549 26.8657 17.8661 25.1012 98.4645 37.4914 62.3024 11.9756 9.9960 7.8334 14.6274 24.2603 42.2421 79.9338 279.6909 85.5033 339.3319 299.0119 23.0730 86.8780 20.4219 25.3639 39.9710 24.5313 68.3837 6.7882 43.6796 34.4976 49.9860 0.8243 5.5544 0.8242 42.8359 137.2680
temp: 298.150 k
press: 1.00000 atm
elementType: 8 8 8 7 7 7 7 6 6 6 6 6 6 6 6 6 6 6 6 1 1 1 1 1 1 1 1 1 1 1 1 1 1 1 1
symmnumber: 1
zpe: 728807.6 jmol-1
zpe.correction: 0.277588 hartree
zpe.thermalcorrener: 0.296273 hartree
zpe.thermalcorrenthalpy: 0.297217 hartree
zpe.thermalcorrgfe: 0.227344 hartree
zpe.sumelectzpe: -910.120507 hartree
zpe.sumelectthermal: -910.101822 hartree
zpe.sumelectthermalent: -910.100878 hartree
zpe.sumelectthermalfe: -910.170752 hartree
dipole: -1.3451 -8.8820 0.7507
dipole: 9.0146
quadrupole: -59.7088 -115.0346 -113.3873
quadrupole: 3.6773 -2.8524 1.3552
quadrupole: 36.3348 -18.9910 -17.3438 3.6773 -2.8524 1.3552
hfenergy: -910.3980951 hartree
pointgroup: C01 [X(C12H16N4O3)]
dipole: 0.4874583 3.4149688 0.8238657 debye
polarizability: 334.5531094|2.5698834|171.2996468|-6.3099403|14.6938607|94.4451142 unknown
InChI: InChI=1S/C12H16N4O3/c1-2-19-12(18)10-6-8(7-14-10)15-16-9-4-3-5-13-11(9)17/h6-7,13-15H,2-5H2,1H3
charge 0 multiplicity 1
35 atoms
O  3.29292 -2.266909 -0.922509
O  -4.884139 -0.026978 -0.016172
O  -3.74311 -2.043431 -0.416772
N  5.209981 -1.058232 -0.441325
N  1.743292 -0.023119 -0.321762
N  0.967945 1.070647 -0.08857
N  -2.622391 1.413556 0.141203
C  5.269526 1.390184 -0.590346
C  3.781467 1.448935 -0.180158
C  5.932463 0.140001 0.014024
C  3.062975 0.11457 -0.370321
C  3.823916 -1.160558 -0.602381
C  -0.431339 0.922091 -0.050474
C  -2.529845 0.040709 -0.107967
C  -1.165658 -0.290653 -0.23102
C  -1.353193 1.96928 0.178694
C  -3.713535 -0.807644 -0.203211
C  -6.171644 -0.774207 -0.087863
C  -7.290279 0.246891 0.097707
H  5.354564 1.342099 -1.691629
H  5.79389 2.301171 -0.247877
H  3.277262 2.240489 -0.777531
H  3.703368 1.763272 0.884777
H  6.985316 0.064346 -0.313503
H  5.935012 0.213932 1.1236
H  5.715452 -1.938465 -0.56567
H  1.36692 2.006434 0.057535
H  -0.751143 -1.275506 -0.427626
H  -1.190271 3.029984 0.358391
H  -3.512023 1.893542 0.268654
H  -6.22501 -1.285651 -1.066012
H  -6.170653 -1.5472 0.702036
H  -8.270699 -0.261447 0.05339
H  -7.207198 0.751937 1.075635
H  -7.261938 1.012328 -0.696949
