program: Gaussian 09
title: 000271575
version: EM64L-G09RevD.01
frameworkgroup: C1[X(C16H17NO6S2)]
method: RPBEPBE
basis: SDD
operation: Freq
keyword: #p
keyword: freq=noraman
keyword: PBEPBE/SDD
title: #p freq=noraman PBEPBE/SDD
converged: YES YES NO NO
title: Mulliken charges:
elementType: S S O O O O O O N C C C C C C C C C C C C C C C C H H H H H H H H H H H H H H H H H
charge: 0.905607 0.306601 -0.523753 -0.496445 -0.276537 -0.408128 -0.232946 -0.253091 -0.206327 -0.062189 -0.140996 -0.531951 -0.235078 -0.235441 -0.137340 0.453069 -0.392955 -0.336892 -0.253571 -0.234746 0.237745 -0.798411 0.310416 -0.254403 -0.663387 0.294401 0.281479 0.280065 0.287703 0.294590 0.244097 0.246080 0.283572 0.228204 0.237439 0.240692 0.223436 0.235590 0.384825 0.217939 0.229072 0.251963
chargesum: 0.00000
title: Mulliken charges with hydrogens summed into heavy atoms:
elementType: S S O O O O O O N C C C C C C C C C C C C C C C C
charge: 0.905607 0.306601 -0.523753 -0.496445 -0.276537 -0.023302 -0.232946 -0.253091 -0.206327 -0.062189 -0.140996 0.043929 0.044988 0.052262 0.157250 0.453069 -0.148858 -0.090812 -0.253571 0.048826 0.237745 -0.092076 0.310416 0.204624 0.035588
polarizability: 4.15757918e+02 -3.34450315e-03 2.94567554e+02 1.81956956e+00 5.61977706e+00 1.60758447e+02
1716.lowfreq: -26.5700 -5.9693 -2.4721 -0.0022 -0.0014 -0.0005 5.0719 9.5855 12.1481
frequency: -26.3893 7.6852 11.9983 26.6913 32.9492 40.4946 47.2483 52.5202 60.2477 71.0551 83.1420 95.7026 105.6997 119.4152 135.8729 140.9380 166.0842 180.1408 200.7106 218.0688 224.1426 231.5072 260.1874 283.2229 302.0254 309.0812 326.8471 339.8587 378.1306 379.7435 404.4293 408.0519 425.0155 443.3806 465.2035 493.0981 505.7608 511.8424 580.0452 584.9745 592.0745 608.3550 620.9920 626.5935 681.4299 702.9347 705.6735 706.8802 726.7814 775.8495 791.5805 804.1674 816.5150 821.2375 826.3414 827.9049 847.7217 922.0505 930.0400 961.7090 962.9329 968.1552 982.0059 983.0906 987.3064 995.1603 1029.6623 1049.7242 1050.2282 1053.0123 1087.2675 1095.3068 1120.1035 1154.1170 1179.5367 1185.9171 1218.5061 1222.0487 1238.6121 1258.0952 1269.4428 1278.8543 1297.1728 1346.1983 1355.8234 1363.3644 1380.4086 1391.4955 1391.6565 1400.9952 1413.7390 1448.8287 1455.5694 1462.9840 1469.8537 1471.6026 1474.7232 1484.5821 1511.3533 1592.6948 1594.0996 1606.8950 1673.6853 2982.7915 2993.5041 3003.4537 3029.4796 3062.9411 3080.8581 3089.0823 3091.9439 3094.0542 3119.7424 3136.8177 3138.3672 3162.9616 3167.3221 3193.7009 3211.5965 3521.3722
redmass: 1.0403 4.9609 5.5745 5.4474 6.6691 5.3857 3.5237 4.8559 7.0708 8.6085 5.4989 5.3357 5.5064 6.4281 6.8429 6.2006 8.1614 7.9170 2.8586 2.4040 6.2519 2.3285 4.8169 5.3459 3.9161 3.0592 8.7815 5.1875 4.5778 6.2792 6.7592 2.8663 6.0142 4.2368 2.3064 5.3789 3.2694 4.2546 5.2369 5.8731 4.4800 2.5780 6.9370 2.1927 5.7357 7.9420 7.3217 3.3158 3.6706 5.5190 11.0739 2.1320 1.7949 1.3839 1.3947 4.0922 1.2473 16.9819 1.4341 2.7837 1.3626 2.4192 1.4701 4.0804 1.8685 2.5917 4.0327 1.6226 2.3811 2.6647 1.8237 2.1366 1.2863 1.6616 2.2468 1.1328 2.9881 1.1754 4.4793 1.7933 1.8345 1.1402 1.2620 2.3393 1.3823 1.8533 4.8393 1.2309 2.9707 1.3019 1.1605 5.0690 1.1376 1.0437 1.0479 2.3420 1.1130 1.0544 5.5362 6.9064 5.9741 10.0351 8.6692 1.0376 1.0362 1.0636 1.0594 1.0972 1.0961 1.0973 1.0993 1.1035 1.1059 1.0893 1.0895 1.0956 1.0963 1.0912 1.0999 1.0643
irintensity: 0.4595 1.3029 2.0375 1.0231 1.2863 0.4460 1.5169 0.2767 1.1313 0.5191 0.6961 0.0907 5.9234 1.2170 5.6487 1.4937 29.1751 5.9272 1.2535 1.8464 13.7999 5.4742 2.9527 5.9990 4.6000 26.4052 3.5682 5.9824 10.3008 13.3746 32.2862 0.0466 72.5581 6.1975 40.1353 49.2321 90.8778 6.5397 18.4862 2.8520 37.2428 44.6170 0.7808 55.3671 36.1903 26.3628 13.5186 0.2030 1.3713 16.1496 89.0577 7.2693 1.5486 50.0383 26.7759 16.1168 0.6805 39.9686 5.8647 46.5591 3.4915 62.9617 0.1880 75.4305 1.8599 9.4109 225.5768 21.9147 21.3763 416.9349 94.9359 21.0437 9.6542 49.6864 24.0573 24.6965 13.1423 3.2301 445.8416 115.6166 81.7527 0.5466 2.3524 7.3214 10.8237 21.0471 2.9863 24.1590 9.3653 14.7774 25.9747 49.2942 36.7369 13.7486 14.1637 28.5813 15.1607 16.0759 27.2435 1.6893 14.9960 243.5439 151.6735 25.5971 23.1306 4.4765 43.2444 14.7418 1.8073 43.5748 17.3298 0.3387 32.7211 12.1083 8.4587 4.2780 8.9901 0.8914 2.9312 42.0588
temp: 298.150 k
press: 1.00000 atm
elementType: 16 16 8 8 8 8 8 8 7 6 6 6 6 6 6 6 6 6 6 6 6 6 6 6 6 1 1 1 1 1 1 1 1 1 1 1 1 1 1 1 1 1
symmnumber: 1
zpe: 795438.0 jmol-1
zpe.correction: 0.302966 hartree
zpe.thermalcorrener: 0.329322 hartree
zpe.thermalcorrenthalpy: 0.330266 hartree
zpe.thermalcorrgfe: 0.240865 hartree
zpe.sumelectzpe: -1920.101173 hartree
zpe.sumelectthermal: -1920.074818 hartree
zpe.sumelectthermalent: -1920.073874 hartree
zpe.sumelectthermalfe: -1920.163274 hartree
dipole: -0.0950 -1.2817 -3.4309
dipole: 3.6637
quadrupole: -128.0826 -137.4243 -170.2837
quadrupole: 14.1149 11.8801 -9.1472
quadrupole: 17.1809 7.8393 -25.0202 14.1149 11.8801 -9.1472
hfenergy: -1920.4041396 hartree
pointgroup: C01 [X(C16H17N1O6S2)]
dipole: -0.1160892 -0.7940538 -1.1973789 debye
polarizability: 413.8648076|3.3433111|290.5804444|-20.4188224|-24.4133464|166.6386665 unknown
InChI: InChI=1S/C9H10NO4S.C7H7O2S/c1-2-14-9(13)6-3-4-7(15-6)10-5-8(11)12;1-6-2-4-7(5-3-6)10(8)9/h3-4,11H,2,5H2,1H3;2-5H,1H3
charge 0 multiplicity 1
42 atoms
S  -1.792382 0.690312 0.539609
S  1.26143 -0.815868 -1.226576
O  -3.082805 1.705917 0.508128
O  -0.650608 0.744129 1.702824
O  5.249527 -0.190405 -1.047161
O  -2.523758 4.199593 -1.972022
O  -0.706753 3.838889 -0.569509
O  4.040337 -2.19882 -0.9260
N  -0.854415 0.905106 -1.396582
C  -2.4582 -1.06697 0.47339
C  0.512914 0.862966 -1.303635
C  -1.57965 2.009971 -2.043595
C  -3.751843 -1.267861 -0.031883
C  -1.638433 -2.10708 0.944606
C  1.523429 1.850409 -1.289567
C  -3.4551 -3.682247 0.385509
C  -4.243176 -2.592229 -0.06822
C  -2.153838 -3.419319 0.893579
C  2.892246 -0.07638 -1.163387
C  2.840445 1.322239 -1.231158
C  -1.517741 3.409656 -1.413909
C  -3.991376 -5.101272 0.34772
C  4.069428 -0.94471 -1.031086
C  6.520718 -0.960582 -0.878456
C  6.829757 -1.1783 0.60545
H  -2.646432 1.737891 -2.104759
H  -1.206373 2.088523 -3.083747
H  -4.360843 -0.418857 -0.35812
H  -0.644094 -1.89509 1.349541
H  1.287049 2.914823 -1.264594
H  -5.252809 -2.777785 -0.451462
H  -1.535513 -4.2497 1.25345
H  3.74722 1.929124 -1.202168
H  -4.963442 -5.155873 -0.170382
H  -3.290213 -5.780587 -0.170628
H  -4.132088 -5.499356 1.370336
H  7.273172 -0.323835 -1.370598
H  6.422372 -1.921396 -1.413649
H  -2.510871 5.102749 -1.553957
H  7.814338 -1.670736 0.711332
H  6.863958 -0.216972 1.146246
H  6.069314 -1.825569 1.07319
