program: Gaussian 09
title: 000271570
version: EM64L-G09RevD.01
frameworkgroup: C1[X(C8H8O5)]
method: RPBEPBE
basis: SDD
operation: Freq
keyword: #p
keyword: freq=noraman
keyword: PBEPBE/SDD
title: #p freq=noraman PBEPBE/SDD
converged: YES YES NO NO
title: Mulliken charges:
elementType: O O O O O C C C C C C C C H H H H H H H H
charge: -0.296200 -0.188937 -0.201083 -0.450788 -0.194700 0.116685 0.154462 0.187798 -0.233125 -0.217875 -0.216211 -0.674775 0.095980 0.296962 0.231259 0.231265 0.299920 0.215048 0.228861 0.228863 0.386593
chargesum: 0.00000
title: Mulliken charges with hydrogens summed into heavy atoms:
elementType: O O O O O C C C C C C C C
charge: -0.296200 -0.188937 -0.201083 -0.064195 -0.194700 0.116685 0.154462 0.187798 0.063837 0.244649 0.083708 -0.002005 0.095980
polarizability: 1.35570656e+02 7.00997048e-01 1.15496513e+02 8.08551854e-03 2.11901030e-03 5.16627510e+01
1716.lowfreq: -44.1024 -5.6348 -4.2228 -0.0006 -0.0005 0.0005 4.5591 31.8212 65.2751
frequency: -44.0845 31.5315 65.0573 92.3211 103.9907 162.3153 182.8627 228.1327 243.7372 262.0011 306.9002 356.4378 379.0509 492.5822 544.1040 544.7511 589.5748 614.0220 650.3076 708.2877 735.1734 771.1229 800.0932 815.7491 829.5571 831.7396 854.9548 961.9304 1016.9343 1028.8791 1047.9443 1091.0015 1112.3547 1136.5268 1162.6769 1197.5805 1237.4045 1249.9865 1286.8610 1357.3936 1401.2686 1411.2846 1464.4811 1474.8059 1486.7643 1502.7463 1533.6465 1650.8116 1684.4536 2996.5442 3010.3548 3068.4439 3092.8638 3107.8463 3282.2195 3289.1873 3534.8824
redmass: 12.6777 6.2055 2.8982 4.7798 2.3308 6.5529 3.9986 2.0990 6.3528 2.1032 5.7743 6.7018 4.5992 9.5581 5.3220 1.5582 4.3386 2.1927 4.9272 6.7383 2.3544 8.5959 1.1089 2.4221 3.6914 1.4105 5.0439 6.9089 2.4323 3.0201 6.3522 9.5503 2.2099 1.4644 1.7877 1.3484 2.3455 1.1326 2.3918 1.3847 1.2792 8.7623 1.0402 1.0588 1.0991 5.0252 7.8117 11.5690 9.5207 1.0358 1.0583 1.1066 1.0984 1.1026 1.0977 1.1041 1.0644
irintensity: 0.0011 1.3931 0.3209 1.7320 4.0261 0.2283 1.1951 0.2293 5.7431 0.6590 11.3897 5.6267 0.3266 5.0470 28.5462 114.0194 6.2331 33.0878 27.9832 66.3909 1.7296 10.6699 1.8505 1.5054 0.8509 50.7117 25.4205 469.1595 22.9648 40.6966 144.7866 45.6471 4.2972 5.5887 253.3764 0.3325 121.0264 0.0010 63.5688 0.2000 22.1684 0.7638 12.3666 5.9374 7.2507 12.0890 43.1089 68.1214 372.7710 20.7780 18.2775 7.9337 29.1559 45.5310 9.3310 3.5390 44.2226
temp: 298.150 k
press: 1.00000 atm
elementType: 8 8 8 8 8 6 6 6 6 6 6 6 6 1 1 1 1 1 1 1 1
symmnumber: 1
zpe: 395224.9 jmol-1
zpe.correction: 0.150533 hartree
zpe.thermalcorrener: 0.162372 hartree
zpe.thermalcorrenthalpy: 0.163317 hartree
zpe.thermalcorrgfe: 0.111300 hartree
zpe.sumelectzpe: -684.786788 hartree
zpe.sumelectthermal: -684.774949 hartree
zpe.sumelectthermalent: -684.774005 hartree
zpe.sumelectthermalfe: -684.826021 hartree
dipole: -0.8299 2.6788 0.0008
dipole: 2.8044
quadrupole: -51.9837 -82.4340 -74.2651
quadrupole: -0.8098 0.0010 -0.0042
quadrupole: 17.5772 -12.8731 -4.7041 -0.8098 0.0010 -0.0042
hfenergy: -684.9373214 hartree
pointgroup: C01 [X(C8H8O5)]
dipole: 0.2943734 1.063355 -0.0005564 debye
dipolederiv: -1.8234249 -0.02442 0.0003093 -0.23815 -0.4855521 -0.0000116 0.0007254 0.0000757 -0.2884425 -0.7116355 -0.0042939 0.000023 0.0203235 -0.6872631 0.0001162 -0.0000427 0.0001283 -0.1282624 -0.6614409 0.1358561 0.0000199 -0.1766923 -0.836872 0.000318 -0.0000845 -0.0001609 -0.2934202 -1.392902 -0.0285513 -0.0004681 0.061794 -0.2804514 -0.000035 -0.0007197 -0.0001134 -0.4413591 -0.6278831 -0.0772799 -0.0001753 0.1167206 -0.9402107 0.0005361 -0.0002169 0.0002356 -0.2978027 -0.2091368 0.2660385 0.000011 0.3674141 -0.3288919 0.0000389 -0.0001859 0.0001778 -0.0261179 -0.0016425 -0.1619655 -0.0000283 -0.2768727 -0.5655694 0.0001272 0.0000575 0.0001905 -0.0064929 1.9619887 -0.1884604 -0.0002105 0.2516001 1.2341868 -0.0003562 -0.0001419 -0.0001509 0.2569298 0.2745987 -0.1696462 0.0000462 -0.4207067 0.2903191 -0.0001124 0.0000739 -0.0000664 -0.0693442 0.9736454 -0.077214 -0.0001821 -0.2227799 0.2677614 0.0000804 -0.0002232 0.0000359 0.3538717 0.0690646 0.1022729 0.0000093 0.3601249 0.4963952 -0.0001429 -0.0000774 -0.0001362 -0.0622358 -0.1232454 -0.0685735 0.0000599 -0.0431047 0.0105003 0.0000338 0.0000754 0.0000328 0.0651446 1.7352011 0.2312693 0.0007206 0.1330467 1.4594833 -0.0007114 0.000838 -0.0004386 0.2559801 0.0896257 -0.0043993 -0.0000077 -0.0394532 0.1080991 0.0000309 -0.0000026 0.000023 0.2028534 -0.0514818 -0.0205581 0.0317024 0.0661665 -0.0049607 0.0870381 -0.007318 0.0995578 -0.0586677 -0.0515207 -0.0206516 -0.031726 0.0660837 -0.0049687 -0.0870726 0.0072905 -0.0995384 -0.0586328 0.0915181 -0.009115 -0.0000148 0.0231298 0.115726 0.0000209 -0.0000194 0.000034 0.2086236 -0.1293718 0.0866932 0.0000874 0.1103418 0.0245789 -0.0000444 0.0001029 -0.000035 0.1164684 0.1116341 0.009938 -0.0245295 -0.0506123 0.007978 0.1076619 0.0052411 0.1135832 -0.064792 0.1116491 0.0098408 0.0243925 -0.0507064 0.0079646 -0.1076317 -0.0053925 -0.1135971 -0.0647948 0.3647599 0.0132199 -0.0000393 -0.0576675 0.1117472 0.000116 0.0000199 0.0001623 0.4004934 unknown
polarizability: 135.5946995|-0.0904932|115.472467|0.0021451|-0.0143428|51.6627534 unknown
InChI: InChI=1S/C8H8O5/c1-2-13-8(11)6-4-12-3-5(6)7(9)10/h3-4,9H,2H2,1H3
charge 0 multiplicity 1
21 atoms
O  2.266337 0.182951 -0.000193
O  -1.15265 2.44031 -0.000607
O  1.008886 -1.785927 0.000053
O  -3.697511 -0.761967 -0.000827
O  -1.908627 -2.248309 0.000879
C  -0.08104 0.415775 0.000098
C  -1.528365 0.183575 -0.000062
C  1.054755 -0.538048 0.00045
C  0.089418 1.793409 -0.000272
C  3.507072 -0.649248 -0.000692
C  -2.125645 1.437776 -0.00049
C  4.687056 0.317227 -0.001217
C  -2.312609 -1.068811 0.000259
H  0.971216 2.424465 -0.000334
H  3.490554 -1.298521 0.893467
H  3.489807 -1.298572 -0.894801
H  -3.162591 1.755704 -0.000711
H  5.634207 -0.252445 -0.001596
H  4.67056 0.961466 -0.896873
H  4.671308 0.961517 0.894415
H  -4.204638 -1.617532 -0.000742
