program: Gaussian 09
title: 000271560
version: EM64L-G09RevD.01
frameworkgroup: C1[X(C5H9ClN2O3)]
method: RPBEPBE
basis: SDD
operation: Freq
keyword: #p
keyword: freq=noraman
keyword: PBEPBE/SDD
title: #p freq=noraman PBEPBE/SDD
converged: YES YES NO NO
title: Mulliken charges:
elementType: Cl O O O N N C C C C C H H H H H H H H H
charge: -0.069646 -0.257182 -0.238247 -0.318786 -0.407276 -0.643179 -0.129195 -0.573097 0.233117 0.283791 -0.496282 0.295116 0.315364 0.282262 0.335402 0.245952 0.238945 0.251192 0.309585 0.342164
chargesum: 0.00000
title: Mulliken charges with hydrogens summed into heavy atoms:
elementType: Cl O O O N N C C C C C
charge: -0.069646 -0.257182 -0.238247 -0.318786 -0.071874 0.008570 0.165922 0.024529 0.233117 0.283791 0.239807
polarizability: 1.03601057e+02 2.50376285e+00 6.78133545e+01 2.25764635e+00 2.36388038e+00 8.28654851e+01
1716.lowfreq: -7.4481 -5.0464 -0.0020 -0.0009 0.0012 11.1462 43.1175 50.5657 69.3391
frequency: 43.1147 50.4952 69.3317 79.3183 96.9496 119.1842 160.8101 183.2032 219.0078 275.0715 307.3044 326.7371 359.8957 469.7913 487.0718 528.8504 556.7821 577.3768 621.6226 671.6246 719.3422 755.8965 827.5312 911.8636 923.2315 982.6569 1018.9182 1045.5757 1115.0578 1130.4765 1152.0003 1167.2051 1207.5672 1245.0232 1274.6375 1320.0041 1363.8360 1423.7785 1435.4803 1454.0844 1462.4083 1501.4025 1596.8486 1634.9249 1646.8737 2974.9389 3011.2052 3076.3418 3117.0757 3158.2495 3168.3750 3530.3421 3548.4004 3703.7622
redmass: 7.5214 6.3212 4.0520 3.3491 1.3910 4.9190 3.4098 5.6066 4.7316 4.3100 2.2880 1.4824 4.3818 3.4043 1.2342 3.1931 1.5579 3.2847 5.7353 4.1092 9.1414 6.0602 4.0490 3.1459 2.9945 3.1012 1.9962 2.1567 1.2631 1.1677 1.4339 2.9107 3.2667 1.3516 1.5974 1.2761 2.0660 1.1708 1.1226 1.0493 1.0510 2.8242 1.6071 3.3103 4.9840 1.0808 1.0293 1.0561 1.1052 1.1053 1.1124 1.0758 1.0478 1.1043
irintensity: 3.0644 0.2862 16.6853 5.5787 0.4642 13.1232 1.9508 3.1940 17.5735 15.0386 1.3648 19.3553 8.7577 21.3305 312.1123 10.4988 80.9047 63.5614 14.1080 3.1721 32.0259 1.0662 14.3074 12.8930 2.0966 42.3993 8.2663 3.1886 0.0110 8.1311 1.6743 222.5978 72.6904 10.5864 13.3214 52.2134 117.8594 11.9248 38.4971 15.2144 14.5530 512.8572 91.1591 454.6508 5.5878 15.7762 25.9637 9.0964 20.5507 12.4039 2.3852 67.0317 38.2272 41.2359
temp: 298.150 k
press: 1.00000 atm
elementType: 17 8 8 8 7 7 6 6 6 6 6 1 1 1 1 1 1 1 1 1
symmnumber: 1
zpe: 393624.4 jmol-1
zpe.correction: 0.149924 hartree
zpe.thermalcorrener: 0.162769 hartree
zpe.thermalcorrenthalpy: 0.163713 hartree
zpe.thermalcorrgfe: 0.109117 hartree
zpe.sumelectzpe: -990.325378 hartree
zpe.sumelectthermal: -990.312533 hartree
zpe.sumelectthermalent: -990.311589 hartree
zpe.sumelectthermalfe: -990.366185 hartree
dipole: 1.4553 -1.9461 -1.2221
dipole: 2.7201
quadrupole: -55.5325 -75.5814 -73.2969
quadrupole: 0.3477 14.0924 2.7807
quadrupole: 12.6044 -7.4445 -5.1599 0.3477 14.0924 2.7807
hfenergy: -990.4753019 hartree
pointgroup: C01 [X(C5H9Cl1N2O3)]
dipole: 0.5731292 0.799384 0.4216126 debye
dipolederiv: -0.1983215 0.0635683 -0.0478366 0.0394131 -0.398998 0.1124219 -0.061373 0.2252617 -0.3402188 -1.3858627 -0.1252231 0.3036358 -0.0484035 -0.3444348 -0.0715652 0.4060487 -0.0613075 -0.573921 -0.671558 -0.1378224 -0.0377286 0.0370307 -0.4691378 -0.2495904 0.2752599 -0.2709961 -0.7438572 -0.8043668 0.0290887 -0.1064745 0.0149304 -0.4676323 -0.1677538 -0.1299207 -0.1721035 -0.9685952 -1.4378085 0.1418469 -0.0094205 -0.0477146 -0.5460436 0.0135641 -0.2880479 -0.0269095 -0.388991 -0.9761095 0.1970587 0.4352316 0.2086358 -0.7907642 -0.0069987 0.5573332 -0.0441833 -0.6476139 0.3597232 -0.2271222 -0.1628458 -0.2588402 0.1928024 -0.0214495 -0.4830082 0.0475533 0.0657787 0.0153344 -0.106529 0.0533087 0.0077064 0.3990588 -0.2713843 0.1565246 -0.3039276 0.4266209 1.4537804 0.2985349 -0.2321613 0.0230633 0.4714274 0.3500471 -0.5857331 0.3659306 1.015757 2.1778224 -0.2988432 -0.1505262 -0.1912661 0.4656592 0.3357148 -0.0217323 0.3512644 1.3712541 0.6642028 0.0859336 -0.0430259 0.1172552 0.2821251 -0.0305191 0.0591128 -0.0097705 0.2155385 0.1044928 0.0251724 -0.0143928 0.0275262 0.0088714 0.0596298 0.1159324 0.016232 0.0115947 0.0473474 -0.0750469 -0.0599745 -0.0712364 0.0394119 0.0506187 -0.0556723 0.0512661 0.0230925 0.0046639 0.072391 0.06897 0.0835509 0.0500813 0.0557059 0.0693827 0.0273287 -0.0363614 0.2524959 0.0360872 -0.0281193 0.080674 0.3181295 -0.0536208 0.0672744 -0.0533686 0.1681636 0.0039834 0.026253 0.0085143 -0.0559156 -0.10856 -0.0065488 -0.0510277 -0.0364825 0.1064079 -0.0182887 0.0059872 0.0721007 0.0320377 0.1047998 -0.0491755 0.1138895 -0.0390453 -0.0017101 0.0044833 -0.0196311 0.0045858 -0.0066811 0.0390435 0.0879136 -0.1043686 0.0772956 -0.0282328 0.1769662 0.0065411 -0.0341061 0.0006545 0.3781757 -0.0737101 -0.035066 -0.0769801 0.1390754 0.2270195 0.0017548 -0.0197346 0.0075795 0.3759846 -0.0632996 -0.0048085 -0.067058 0.1862181 unknown
polarizability: 103.5522727|-2.1804711|68.0992092|-2.5902624|3.2762726|82.6284149 unknown
InChI: InChI=1S/C5H9ClN2O3/c1-11-4(9)3(2-6)8-5(7)10/h3,8H,2,7H2,1H3
charge 0 multiplicity 1
20 atoms
Cl 0.589475 -2.518372 0.832069
O  2.3707 0.32336 -0.718426
O  1.393022 1.120708 1.241002
O  -2.666667 -0.11511 -1.209683
N  -1.079936 0.287044 0.448787
N  -3.368524 0.608715 0.898684
C  0.016585 -0.052538 -0.446528
C  0.15006 -1.562803 -0.73549
C  1.306305 0.533616 0.138517
C  -2.389872 0.241462 -0.018752
C  3.69508 0.795785 -0.237065
H  -0.164668 0.410537 -1.439865
H  -0.812083 -1.962029 -1.083421
H  0.962862 -1.761132 -1.447775
H  -0.823168 0.600891 1.387721
H  3.671182 1.886032 -0.075368
H  4.394777 0.526364 -1.039512
H  3.952646 0.288309 0.706972
H  -3.168745 0.887441 1.85654
H  -4.333029 0.572918 0.580194
