program: Gaussian 09
title: 000271556
version: EM64L-G09RevD.01
frameworkgroup: C1[X(C14H17NO3)]
method: RPBEPBE
basis: SDD
operation: Freq
keyword: #p
keyword: freq=noraman
keyword: PBEPBE/SDD
title: #p freq=noraman PBEPBE/SDD
converged: YES YES NO NO
title: Mulliken charges:
elementType: O O O N C C C C C C C C C C C C C C H H H H H H H H H H H H H H H H H
charge: -0.272710 -0.412411 -0.238979 -0.210511 0.166265 0.195664 0.216685 0.211108 -0.630403 -0.568074 -0.330583 -0.816733 -0.662459 0.324300 -0.379544 0.206158 -0.235432 -0.689585 0.243498 0.233495 0.260177 0.233615 0.230517 0.262812 0.242235 0.250908 0.238876 0.238249 0.244984 0.206299 0.202757 0.204154 0.230029 0.230157 0.374484
chargesum: 0.00000
title: Mulliken charges with hydrogens summed into heavy atoms:
elementType: O O O N C C C C C C C C C C C C C C
charge: -0.272710 -0.037926 -0.238979 -0.210511 0.166265 0.195664 0.216685 0.211108 -0.153410 -0.307898 -0.096968 -0.081170 0.065573 0.324300 -0.134561 0.206158 0.173624 -0.025245
polarizability: 2.43607370e+02 6.96314152e+00 1.82131329e+02 -5.71342655e+00 9.06240358e+00 1.03056046e+02
1716.lowfreq: -15.8895 -3.9531 -0.0007 -0.0005 0.0003 5.5522 9.4420 42.2934 43.6904
frequency: -13.1078 42.2831 43.6489 47.0483 68.9504 104.7942 106.9895 111.6315 125.7865 155.6815 174.8024 201.0205 229.9889 238.2751 250.7072 285.7411 309.4000 340.2783 390.8763 403.9509 412.1629 435.2307 487.5113 493.9930 552.1220 558.7747 582.1902 601.4979 625.0464 657.3789 686.4783 697.7059 738.6080 758.4365 801.2074 821.6271 830.9351 838.7050 853.2823 862.5588 928.1108 931.2759 935.0178 999.4865 1032.8171 1041.4177 1046.9910 1085.6805 1116.2575 1118.4934 1123.7629 1133.9068 1137.2117 1155.8929 1195.8325 1220.2796 1258.4623 1260.1137 1279.8158 1300.8260 1319.4466 1358.4799 1374.9932 1398.0911 1398.6682 1412.2627 1418.1365 1443.5781 1450.9822 1458.4793 1461.3879 1469.5892 1474.7792 1478.0306 1480.4419 1486.8950 1494.7183 1496.3887 1574.1237 1590.3927 1629.6724 1659.2649 2945.7597 2969.0199 2973.4422 2995.0308 3000.9360 3023.0715 3037.6672 3046.2920 3088.3701 3092.1932 3103.1212 3103.5053 3114.3032 3138.7057 3160.9925 3169.2963 3504.1999
redmass: 6.2684 8.9154 1.5642 1.8081 4.3249 3.1850 2.3398 2.7673 2.2959 1.1617 4.1637 4.1118 3.8650 3.3858 1.2582 2.9274 3.0248 5.2479 6.7472 2.2963 4.1906 2.8644 4.5389 3.7521 3.8907 4.8588 3.3455 3.4273 1.8484 2.9230 4.4560 4.2536 4.3331 4.0030 1.5240 1.3332 3.0789 2.8599 1.8251 2.8930 2.8274 1.3291 2.1366 2.3814 2.2457 1.6062 2.5477 2.1079 2.1167 1.3025 1.6830 1.3129 1.4402 2.4701 1.5111 4.3965 1.6274 1.1724 1.4794 2.0310 2.1245 1.7307 2.3045 1.3518 1.6872 2.7118 3.3850 1.2864 1.1717 1.1679 1.0404 1.6663 2.5885 1.1014 1.0862 1.3379 1.2028 1.2069 6.5266 7.5562 7.2825 8.2999 1.0553 1.0399 1.0372 1.0361 1.1070 1.0589 1.0979 1.1013 1.1034 1.0989 1.1011 1.0945 1.0964 1.0887 1.0912 1.0956 1.0638
irintensity: 0.7314 1.9880 0.9977 2.5073 1.0983 1.6816 1.7302 1.5183 0.1234 0.2300 2.9104 1.0664 2.5405 1.2954 1.8275 0.5797 1.6278 0.9464 0.5163 3.1394 0.6410 4.4371 9.2833 17.0302 35.7984 8.7399 0.1463 9.8540 75.4018 53.1780 22.3648 19.1821 2.2615 1.8922 46.3317 19.6172 13.8045 7.4050 21.5722 4.6692 24.8708 0.3363 42.6669 56.6658 11.5585 16.7157 117.6686 95.7039 1.4620 0.8349 6.8729 19.0380 4.4841 98.1711 95.8377 84.2469 11.9356 0.6856 2.0893 23.3514 51.4146 16.9644 22.5315 59.0811 6.5066 24.4313 14.9593 15.5817 32.0480 41.0852 11.4998 91.2115 8.8895 37.8534 0.8981 63.7406 17.7205 8.4807 4.3510 32.3988 54.1815 246.0439 34.8128 46.3140 87.3914 30.7690 39.5683 22.3119 16.7526 28.8818 6.2284 29.2767 36.2888 10.9617 9.5491 11.0893 9.1000 9.2121 16.5496
temp: 298.150 k
press: 1.00000 atm
elementType: 8 8 8 7 6 6 6 6 6 6 6 6 6 6 6 6 6 6 1 1 1 1 1 1 1 1 1 1 1 1 1 1 1 1 1
symmnumber: 1
zpe: 741826.3 jmol-1
zpe.correction: 0.282547 hartree
zpe.thermalcorrener: 0.300200 hartree
zpe.thermalcorrenthalpy: 0.301144 hartree
zpe.thermalcorrgfe: 0.236213 hartree
zpe.sumelectzpe: -822.791538 hartree
zpe.sumelectthermal: -822.773885 hartree
zpe.sumelectthermalent: -822.772941 hartree
zpe.sumelectthermalfe: -822.837871 hartree
dipole: -0.9410 -0.7187 0.4823
dipole: 1.2785
quadrupole: -102.7425 -94.0535 -105.9998
quadrupole: 18.5254 -2.3498 2.3960
quadrupole: -1.8106 6.8784 -5.0678 18.5254 -2.3498 2.3960
hfenergy: -823.0740848 hartree
pointgroup: C01 [X(C14H17N1O3)]
dipole: -0.3306561 -0.3265699 0.1924602 debye
polarizability: 240.765685|14.0237628|183.9026193|-10.9193534|10.0257522|104.126441 unknown
InChI: InChI=1S/C14H17NO3/c1-4-18-10-5-6-13-12(7-10)11(8-14(16)17)9(2)15(13)3/h5-7,16H,4,8H2,1-3H3
charge 0 multiplicity 1
35 atoms
O  3.584227 0.001139 -0.279711
O  -1.046376 3.247635 -0.655719
O  -3.29124 2.649544 -0.688686
N  -1.660799 -1.936974 -0.105367
C  -1.452999 0.249736 0.534987
C  -0.136159 -0.245949 0.189868
C  -0.295303 -1.618674 -0.195598
C  -2.366219 -0.798609 0.335542
C  -1.781936 1.650317 1.007868
C  1.154748 0.348321 0.174146
C  0.804861 -2.416123 -0.58206
C  -3.857711 -0.804727 0.513155
C  -2.218205 -3.253898 -0.411338
C  2.249404 -0.45285 -0.214145
C  2.078488 -1.821563 -0.585731
C  -2.159153 2.543284 -0.166477
C  3.840935 1.404579 0.083104
C  5.342237 1.63556 -0.071222
H  -0.915023 2.088025 1.530066
H  -2.638671 1.643146 1.703268
H  1.276054 1.402889 0.436408
H  0.686073 -3.465635 -0.871605
H  -4.19005 -1.545641 1.266153
H  -4.201654 0.190643 0.835344
H  -4.385364 -1.028112 -0.43424
H  -3.315701 -3.221871 -0.337691
H  -1.950183 -3.562889 -1.438898
H  -1.844344 -4.020722 0.293681
H  2.967899 -2.388493 -0.876598
H  3.259325 2.073558 -0.585452
H  3.511586 1.584158 1.128316
H  5.596885 2.679267 0.188942
H  5.909361 0.960167 0.592033
H  5.659406 1.445873 -1.111007
H  -1.316296 3.764993 -1.463134
