program: Gaussian 09
title: 000271543
version: EM64L-G09RevD.01
frameworkgroup: C1[X(C10H9NO5)]
method: RPBEPBE
basis: SDD
operation: Freq
keyword: #p
keyword: freq=noraman
keyword: PBEPBE/SDD
title: #p freq=noraman PBEPBE/SDD
converged: YES YES NO NO
title: Mulliken charges:
elementType: O O O O O N C C C C C C C C C C H H H H H H H H H
charge: -0.132131 -0.192930 -0.206998 -0.370230 -0.216549 0.018273 0.474928 0.235586 -0.674348 0.474356 -0.384641 -0.535794 -0.393868 -0.799475 0.153099 0.141895 0.291252 0.246427 0.242171 0.288534 0.242850 0.236965 0.244149 0.229452 0.387025
chargesum: 0.00000
title: Mulliken charges with hydrogens summed into heavy atoms:
elementType: O O O O O N C C C C C C C C C C
charge: -0.132131 -0.192930 -0.206998 0.016796 -0.216549 0.018273 0.474928 0.235586 -0.136669 0.474356 -0.142470 -0.247260 -0.151018 -0.088909 0.153099 0.141895
polarizability: 1.87659880e+02 7.11678764e+00 1.35495592e+02 -8.34851586e+00 5.29211255e+00 8.61836966e+01
1716.lowfreq: -48.8391 -6.4331 -0.0001 0.0006 0.0008 4.3478 7.8751 28.4392 37.6093
frequency: -48.7356 28.4314 37.6048 46.4571 62.7095 92.2281 137.0769 166.4806 188.8444 219.2438 281.1385 324.4080 338.8354 362.3353 380.1154 395.0659 430.0759 471.6478 502.7594 525.0132 544.0418 590.5156 625.0855 667.7550 674.8235 693.5834 725.8857 746.1423 773.2796 811.7705 851.6668 900.9229 922.1567 937.6744 979.2895 998.9076 1005.2640 1051.1780 1065.6371 1098.7975 1146.6825 1185.1726 1198.0317 1217.4419 1230.0931 1282.8252 1307.0326 1331.8288 1349.0951 1377.9359 1401.6893 1412.1197 1444.6348 1469.3155 1474.0226 1503.1211 1570.5371 1623.8925 1625.6763 1641.1300 2983.1713 2993.1407 3066.1895 3073.3729 3095.1862 3131.2604 3153.6775 3169.8871 3509.9830
redmass: 1.0155 11.3782 7.4390 6.4646 9.4325 7.5613 6.3294 4.6613 7.6402 5.1381 4.9009 3.9375 5.5542 4.9545 3.1518 5.7412 3.5362 6.2654 4.9133 4.1410 4.3834 2.2358 1.8047 7.4183 4.6633 4.1419 5.4885 7.9907 5.3953 2.3250 2.0099 3.8187 1.4715 2.1845 1.4133 3.6354 1.5596 1.6231 2.8095 2.0820 1.5014 1.1664 4.7873 2.5339 3.3944 1.4348 1.6688 2.4764 6.7182 4.2351 1.2186 4.3278 1.1215 1.1019 1.0549 3.2508 6.0929 8.7969 8.2271 9.9793 1.0390 1.0646 1.0951 1.0940 1.1001 1.0882 1.0969 1.0920 1.0643
irintensity: 0.7554 1.3042 6.1711 1.0098 0.8924 0.2701 0.3390 0.3957 4.7181 7.8612 3.6799 1.0620 1.4917 0.7681 0.8203 2.6210 0.2720 9.4735 6.0647 9.3450 13.9390 68.3723 172.8902 14.6946 2.8920 22.6196 4.6328 10.0611 9.5383 12.6097 12.3549 8.6518 5.2113 4.3933 7.7625 211.2307 16.7989 9.4788 24.8895 66.3290 7.0216 7.9631 210.2822 17.0530 38.3943 24.0537 46.7656 3.4903 154.4108 42.4840 14.2648 8.3121 21.4583 13.2627 14.5531 69.1993 16.9096 80.0474 115.0112 86.2306 22.6279 7.9229 16.3179 6.9246 12.5398 8.4805 13.4717 3.5502 43.5126
temp: 298.150 k
press: 1.00000 atm
elementType: 8 8 8 8 8 7 6 6 6 6 6 6 6 6 6 6 1 1 1 1 1 1 1 1 1
symmnumber: 1
zpe: 464288.6 jmol-1
zpe.correction: 0.176838 hartree
zpe.thermalcorrener: 0.191186 hartree
zpe.thermalcorrenthalpy: 0.192130 hartree
zpe.thermalcorrgfe: 0.133536 hartree
zpe.sumelectzpe: -816.086488 hartree
zpe.sumelectthermal: -816.072141 hartree
zpe.sumelectthermalent: -816.071197 hartree
zpe.sumelectthermalfe: -816.129791 hartree
dipole: -3.5976 -3.0393 -1.1861
dipole: 4.8566
quadrupole: -68.5038 -93.8450 -100.3005
quadrupole: 4.0822 0.6587 4.5289
quadrupole: 19.0460 -6.2952 -12.7507 4.0822 0.6587 4.5289
hfenergy: -816.2633265 hartree
pointgroup: C01 [X(C10H9N1O5)]
dipole: -1.2901326 1.2354738 0.6783152 debye
dipolederiv: -0.4617493 0.0734532 -0.0387938 -0.0489461 -0.4202023 0.1704737 0.2566424 0.2252818 -0.636253 -0.5924096 -0.192592 -0.0112039 -0.1501967 -0.8665902 -0.1080425 -0.0479432 -0.1556977 -0.2343023 -1.09862 -0.0536106 0.0248719 0.0474825 -0.5119705 -0.0444616 0.0094935 -0.0163568 -0.2003339 -0.7757179 0.0449776 0.5074111 0.1453511 -0.3816512 -0.2191161 0.4946462 -0.160672 -0.7892704 -0.7068103 0.0977775 -0.2065033 0.135277 -0.3283085 0.106264 0.1230947 -0.0633764 -0.8646597 1.4501519 -0.0548834 -0.0680805 -0.2761588 1.4581607 0.2299514 -0.0081724 0.2650756 0.2056007 0.3105832 0.1334387 0.0499374 -0.2829667 0.1301974 0.0115366 0.0763475 0.0356738 -0.0271929 -0.1594572 0.2982367 0.0932619 0.2900973 -0.4742819 -0.0754095 0.0470638 -0.0928758 0.0562751 -0.3844473 0.0021683 0.1489651 0.189642 0.1224785 -0.0131882 0.1770842 -0.0111645 -0.1825252 0.5286998 -0.0009845 0.1054791 -0.0004943 -0.28362 -0.0696487 0.0423666 -0.0633246 -0.0390397 -0.3117754 0.1025231 0.0225094 0.203132 0.0689521 0.0822651 0.0032426 0.072336 -0.0906943 -0.1433776 -0.2754917 -0.081119 0.1275405 0.0590813 0.0665286 0.0183803 0.0128996 -0.1063576 -0.0050264 -0.0215427 0.0129524 -0.1156999 0.1664436 0.0580058 -0.0013085 0.085888 -0.0850671 -0.1968892 0.0006429 -0.0401009 -0.0487196 0.0747104 -0.0069382 0.058011 -0.0127431 0.0610926 0.8950284 -0.1103294 -0.1758997 0.0576704 0.520834 -0.1828773 -0.6098525 -0.2203341 0.7640346 0.9991825 -0.1620101 -0.1767178 -0.2667405 0.3096003 0.0773107 -0.3741934 0.1766119 1.3265741 0.102412 0.0049352 -0.0402537 -0.0247332 0.0188183 0.0713585 -0.0021894 0.0307921 0.0805803 0.0768235 0.0176476 0.0277479 -0.0927439 -0.0602239 -0.0738792 -0.0100057 -0.0458841 0.0723888 0.0397352 -0.0837122 -0.0590387 -0.0504275 -0.0161612 -0.057267 -0.0461068 -0.0620242 0.1083981 0.1054544 -0.0156012 -0.0242949 -0.0631609 0.0720886 -0.0396642 -0.0234293 -0.0388242 0.1368916 0.0249808 0.1005869 0.0033773 0.0990622 -0.0184775 -0.0310499 -0.0023192 -0.0254655 0.1341402 0.057348 0.0156457 -0.0088323 -0.0355208 0.0151851 -0.1226012 -0.085002 -0.0828836 -0.0133031 -0.0514075 -0.0166261 0.053969 -0.0396202 0.0999466 0.0552875 0.0926388 0.0555016 -0.0304539 0.0434626 0.0163494 -0.0244915 0.1046468 -0.0964566 0.0656001 -0.0537001 0.0272364 0.0931099 0.2538253 0.0790011 -0.0951523 0.0962271 0.3414469 0.0495615 -0.1347891 0.0643295 0.2603669 unknown
polarizability: 185.3173336|-14.0959152|134.4314688|8.0066164|12.9083716|89.5903661 unknown
InChI: InChI=1S/C10H9NO5/c1-6-2-3-7(5-9(12)10(13)14)8(4-6)11(15)16/h2-4,13H,5H2,1H3
charge 0 multiplicity 1
25 atoms
O  1.806607 1.170079 -1.393632
O  -0.953537 -2.773777 -0.426073
O  1.026341 -1.701756 -0.148193
O  4.112224 -0.313285 -1.107629
O  3.800601 -0.257267 1.197611
N  -0.272088 -1.705537 -0.18941
C  -0.350788 0.719339 0.558035
C  -1.003916 -0.436367 0.038785
C  1.114492 0.783385 0.939007
C  -3.170734 0.706409 -0.118439
C  -1.164492 1.866354 0.720733
C  -2.379596 -0.448792 -0.288686
C  -2.534992 1.869472 0.390026
C  -4.650322 0.69766 -0.452243
C  2.049875 0.669989 -0.274762
C  3.397096 -0.017508 0.036519
H  1.399921 0.004824 1.665783
H  1.320456 1.760046 1.420889
H  -0.703195 2.780946 1.108877
H  -2.81185 -1.374774 -0.678611
H  -3.119022 2.787338 0.524333
H  -4.873599 0.009635 -1.28551
H  -5.248983 0.365693 0.417702
H  -5.006514 1.703713 -0.732961
H  4.966312 -0.764821 -0.864254
