program: Gaussian 09
title: 000271507
version: EM64L-G09RevD.01
frameworkgroup: C1[X(C9H9ClS)]
method: RPBEPBE
basis: SDD
operation: Freq
keyword: #p
keyword: freq=noraman
keyword: PBEPBE/SDD
title: #p freq=noraman PBEPBE/SDD
converged: YES YES NO NO
title: Mulliken charges:
elementType: Cl S C C C C C C C C C H H H H H H H H H
charge: -0.072908 0.204140 -0.176632 -0.267442 -0.210051 -0.755200 -0.206888 -0.223200 -0.234331 0.222998 -0.552638 0.253215 0.261882 0.280769 0.297917 0.230364 0.230434 0.231221 0.253201 0.233148
chargesum: 0.00000
title: Mulliken charges with hydrogens summed into heavy atoms:
elementType: Cl S C C C C C C C C C
charge: -0.072908 0.204140 -0.176632 -0.014227 0.051831 -0.176514 0.023476 0.007235 -0.003110 0.222998 -0.066288
polarizability: 1.87492482e+02 1.56181308e+01 1.20971786e+02 -9.89682484e-01 -1.11810197e-01 6.28583819e+01
1716.lowfreq: -13.3047 -9.2369 -0.0030 -0.0026 -0.0025 3.4833 32.2738 37.1985 57.1999
frequency: 32.2464 37.0703 57.1918 113.1536 152.6312 213.7081 277.1718 345.9457 375.5456 391.0234 405.7076 478.0183 490.9661 566.4092 610.3122 637.7023 674.7603 696.6105 708.3208 751.7072 848.9548 876.6137 920.6666 921.3151 935.2215 975.7087 985.1454 994.8609 1016.0715 1071.0693 1074.6730 1101.7273 1171.8654 1185.4307 1206.5910 1231.3348 1303.9128 1373.0102 1400.8396 1424.9117 1436.7225 1459.6210 1584.3944 1587.9737 1648.8431 3036.8463 3112.4663 3115.3785 3127.0400 3134.9886 3147.0309 3155.3420 3168.0520 3227.7595
redmass: 4.9153 6.1569 5.2835 5.3891 5.1790 4.9304 5.2952 2.7621 2.7086 7.6576 3.0269 4.3258 5.3234 4.8740 6.4138 2.0065 6.7263 2.2844 1.5602 1.4712 1.2459 1.5322 1.3624 1.3540 2.1186 1.4341 5.3830 1.3142 3.3832 2.4183 1.6031 1.4793 1.0532 1.1177 1.6350 1.1669 1.3258 8.5193 1.1307 2.0202 1.1474 2.0545 6.2141 5.9442 5.9575 1.0576 1.0685 1.1018 1.0847 1.0881 1.0928 1.0965 1.1017 1.1147
irintensity: 1.3696 0.8757 0.8866 0.1210 0.5503 1.5778 0.1936 3.3316 1.8446 0.2757 0.4640 9.5542 15.1527 28.2184 0.6179 6.2569 12.0268 34.2002 6.5348 75.3971 0.0994 15.3401 30.4094 54.4469 2.8362 0.2133 2.3282 0.2044 19.0266 6.2455 7.7747 26.8117 0.0408 0.8654 36.9457 9.9170 0.7028 0.2185 8.8027 9.7658 16.7274 39.7298 1.6351 21.6199 48.9040 10.8087 1.5590 2.7852 0.3087 6.8294 6.9025 22.2801 25.9778 3.0267
temp: 298.150 k
press: 1.00000 atm
elementType: 17 16 6 6 6 6 6 6 6 6 6 1 1 1 1 1 1 1 1 1
symmnumber: 1
zpe: 394639.6 jmol-1
zpe.correction: 0.150310 hartree
zpe.thermalcorrener: 0.161369 hartree
zpe.thermalcorrenthalpy: 0.162313 hartree
zpe.thermalcorrgfe: 0.111131 hartree
zpe.sumelectzpe: -1205.649669 hartree
zpe.sumelectthermal: -1205.638610 hartree
zpe.sumelectthermalent: -1205.637666 hartree
zpe.sumelectthermalfe: -1205.688848 hartree
dipole: 0.2607 -0.6328 2.0114
dipole: 2.1246
quadrupole: -66.3458 -75.5964 -83.3952
quadrupole: 4.8390 -1.6436 -1.4524
quadrupole: 8.7667 -0.4840 -8.2827 4.8390 -1.6436 -1.4524
hfenergy: -1205.7999793 hartree
pointgroup: C01 [X(C9H9Cl1S1)]
dipole: 0.0282187 -0.4595926 0.69762 debye
dipolederiv: -0.2795706 -0.0848911 -0.0061846 -0.0701022 -0.6665418 0.0726334 -0.0136833 0.0807845 -0.0785186 -0.470936 -0.0068355 -0.0433972 0.1251053 -0.0827574 0.0734759 0.0011536 0.0225745 0.018612 0.6989331 0.1338917 0.1769142 0.2370261 0.0201541 0.0097328 0.2676452 0.0204753 -0.1026971 -0.3482726 0.0126668 -0.0162587 -0.1096696 0.0269227 0.0540676 -0.0251685 0.0811079 -0.0992753 -0.2064446 -0.1056702 -0.033395 -0.1139346 -0.0822574 -0.0024029 -0.1301534 -0.0367125 -0.1502828 0.2955738 -0.0819245 -0.1531469 -0.1991395 -0.0997993 -0.0278861 -0.2200951 0.0140022 0.133383 0.0860295 -0.0996729 0.014663 -0.0382552 0.0190593 0.0536078 0.0383949 0.0456953 -0.1124345 -0.0098983 0.020753 0.0420162 0.0059531 0.0957979 0.0921258 0.0308273 0.0968292 -0.1022981 0.0146626 0.0399096 0.0677809 0.0116262 -0.0785492 0.042948 0.0381254 0.0461938 -0.1346934 0.4777561 0.2119079 0.0320625 0.0517776 0.9711761 -0.1130613 0.1204078 -0.1605359 -0.1383566 -0.420924 -0.0935396 0.0594112 -0.0183439 -0.1707018 -0.0601163 0.0238728 -0.0280003 -0.3331005 0.1121618 -0.0377698 -0.0316468 -0.0189168 -0.031945 -0.0661105 -0.0111726 -0.0730184 0.1225382 0.0683662 0.0733842 -0.0058031 0.0709678 0.0555471 -0.0213366 -0.0046323 -0.0162568 0.1335106 -0.0686286 -0.0335871 0.0780782 -0.0068906 -0.0465314 0.0633386 0.1016759 0.0501348 0.0668702 0.0058026 -0.0060049 -0.0396202 0.0207291 0.0659088 -0.0770902 -0.0247758 -0.0345355 0.0017837 -0.0707711 0.1010744 -0.0019209 0.1112545 0.0160646 -0.0330946 -0.0081821 -0.0368388 0.1443926 0.0598481 -0.0154925 -0.0250997 -0.0460198 -0.0766997 -0.0958037 -0.0287975 -0.0948371 0.115707 -0.0985862 -0.0509355 -0.0731312 -0.0549528 0.0826717 -0.0431852 -0.0785456 -0.0465704 0.1285344 0.039971 0.0605613 -0.0318168 0.0574675 0.0442879 0.0405624 -0.0756417 0.0373591 0.2083171 0.1149272 -0.0378253 -0.0095051 -0.0156822 -0.0618072 0.037595 -0.0012547 0.0321492 0.1780081 unknown
polarizability: 189.9392694|5.5108864|114.1930944|7.8389272|14.3780245|67.190286 unknown
InChI: InChI=1S/C9H9ClS/c1-8(10)7-11-9-5-3-2-4-6-9/h2-6H,1,7H2
charge 0 multiplicity 1
20 atoms
Cl -2.506995 1.798716 -0.128326
S  -0.648885 -1.171304 -1.069165
C  0.982573 -0.609845 -0.410893
C  2.083706 -1.492795 -0.518073
C  1.156855 0.687225 0.129617
C  -1.796022 -0.860125 0.440849
C  3.363299 -1.073476 -0.085052
C  2.434198 1.089103 0.582083
C  3.540729 0.213992 0.472327
C  -2.955234 0.030291 0.116292
C  -4.251588 -0.333949 -0.003332
H  1.937034 -2.497939 -0.927014
H  0.309068 1.379416 0.177031
H  -2.16385 -1.847863 0.762361
H  -1.152658 -0.434457 1.227245
H  4.214242 -1.758158 -0.172435
H  2.56577 2.09231 1.002757
H  4.531004 0.533394 0.815199
H  -5.043459 0.380985 -0.239479
H  -4.534489 -1.38352 0.134105
