program: Gaussian 09
title: 000271472
version: EM64L-G09RevD.01
frameworkgroup: C1[X(C17H28O7)]
method: RPBEPBE
basis: SDD
operation: Freq
keyword: #pfreq=noraman
keyword: PBEPBE/SDD
title: #p freq=noraman PBEPBE/SDD
converged: NO YES NO NO
title: Mulliken charges:
elementType: O O O O O O O C C C C C C C C C C C C C C C C C H H H H H H H H H H H H H H H H H H H H H H H H H H H H
charge: -0.258814 -0.269461 -0.212821 -0.201805 -0.252802 -0.256553 -0.438553 -0.067703 -0.442481 -0.335994 -0.348136 -0.376661 -0.398324 0.201856 0.209057 0.257291 0.287652 -0.332628 -0.781818 -0.801163 -0.232388 -0.262545 -0.677236 -0.660315 0.233893 0.260430 0.234408 0.270515 0.283818 0.184517 0.192584 0.220470 0.193303 0.183866 0.213303 0.237345 0.252329 0.276171 0.276037 0.248483 0.250722 0.225177 0.256072 0.230269 0.224398 0.330458 0.225555 0.235889 0.213654 0.250896 0.234826 0.212957
chargesum: 0.00000
title: Mulliken charges with hydrogens summed into heavy atoms:
elementType: O O O O O O O C C C C C C C C C C C C C C C C C
charge: -0.258814 -0.269461 -0.212821 -0.201805 -0.252802 -0.256553 -0.108095 0.166190 0.052357 -0.065479 -0.064318 0.000440 0.015449 0.201856 0.209057 0.257291 0.287652 0.064542 -0.015972 -0.025920 0.248861 0.192122 -0.002137 0.038364
polarizability: 2.05973526e+02 6.08344907e+00 2.00363732e+02 -7.50012696e+00 -3.93761074e+00 2.07081052e+02
1716.lowfreq: -9.1460 -7.6868 -0.0009 -0.0007 -0.0004 4.6022 19.8930 23.1397 33.7950
frequency: 19.7895 23.0194 33.7869 35.5569 44.3942 47.2922 53.9571 55.3579 60.4150 75.3394 80.2975 88.0753 95.5128 107.5754 120.9450 124.5953 130.8840 137.8274 147.7044 156.9498 162.4801 186.3364 189.9732 198.6687 217.1147 225.4923 240.0412 255.5930 280.1845 311.0066 312.2431 328.1815 339.1424 342.8401 387.8051 391.9691 425.2723 451.4086 476.7789 479.1065 512.2856 556.8911 587.2039 596.9153 629.0689 682.4728 714.2862 731.0788 749.3535 777.0524 802.0586 803.3227 805.5948 813.8392 826.0981 848.5749 897.8394 903.0843 913.0332 949.0945 964.1683 970.0050 975.2329 1009.3219 1012.8852 1020.4572 1023.9221 1034.2615 1042.4070 1061.1509 1069.3188 1077.1882 1096.2967 1100.4151 1112.6383 1123.1249 1136.7023 1137.8246 1153.3886 1156.9906 1168.6691 1187.1290 1212.4173 1229.7147 1250.6253 1253.6967 1255.2614 1268.4436 1274.6776 1275.7173 1286.9437 1292.8276 1313.5422 1334.1726 1343.8030 1352.7991 1357.0237 1360.2894 1371.6616 1372.1513 1380.4957 1384.1249 1392.9302 1400.6186 1447.5350 1448.0592 1450.9687 1454.3051 1458.6062 1461.9873 1463.0392 1463.2926 1464.9258 1473.8085 1479.0902 1483.9255 1484.0377 1487.6409 1615.4291 1625.6163 1630.1916 1641.1868 2944.5882 2949.2116 2964.1622 2969.0535 2977.0791 2985.8333 2990.6314 2992.4792 2995.2316 2996.7242 3004.5015 3017.8309 3030.0544 3030.6136 3033.7332 3060.8729 3068.2994 3072.9661 3075.3025 3080.4082 3091.0325 3093.1835 3095.4622 3110.7082 3121.3503 3122.2352 3123.7656 3558.6163
redmass: 4.8765 4.5759 3.6803 3.3346 3.1227 2.0090 4.5786 3.8427 4.2214 2.9008 3.3794 4.3506 4.1762 3.8299 3.9301 4.2517 2.1289 1.2623 4.2168 3.3239 3.1675 1.3318 1.9568 1.5569 3.2216 3.0522 3.0325 1.6560 4.7089 1.4877 2.0867 4.6829 2.7828 3.8174 4.4253 3.8240 4.1826 3.6115 3.6033 3.3440 4.4593 4.0834 3.9606 4.3515 3.5499 4.2662 3.9803 1.2742 3.2116 1.7132 1.4229 1.2143 2.7210 2.0759 2.8596 3.1328 2.1023 4.1452 2.0850 4.4449 2.2350 1.9387 2.2701 2.1868 2.2038 2.1891 2.3031 2.5963 3.5599 2.7474 2.2213 2.5421 2.0769 1.6889 2.3650 2.7750 2.2608 1.5309 1.7237 1.6867 1.9808 2.5076 1.4297 1.6557 1.4450 1.3132 1.2107 1.5067 1.4894 1.1404 1.0983 1.3238 1.2571 1.3635 1.3480 1.2907 1.4114 1.4417 1.2645 1.2361 1.3113 1.2929 1.2297 1.2701 1.0707 1.0584 1.0606 1.0693 1.0856 1.0496 1.0608 1.0511 1.0815 1.0684 1.0863 1.0529 1.0656 1.0953 9.2639 8.6648 7.7242 9.3749 1.0649 1.0627 1.0641 1.0814 1.0378 1.0437 1.0801 1.0877 1.0365 1.0359 1.0668 1.0587 1.0739 1.0676 1.0963 1.0948 1.0981 1.0959 1.0995 1.1054 1.0973 1.0983 1.1036 1.1037 1.1054 1.1012 1.1007 1.0661
irintensity: 0.6447 0.3491 1.3288 0.4069 0.6431 1.8296 1.3364 3.0932 7.7881 5.3599 1.5416 4.2343 2.3073 1.4692 1.4389 0.6323 3.6665 0.3411 2.4624 2.2281 1.2534 3.2674 3.1381 6.4784 0.1179 1.9336 0.6166 2.3620 5.7695 72.0016 67.3868 9.6894 48.0301 1.3911 5.7556 10.3889 3.1796 9.6170 10.1717 1.4117 6.0897 7.9851 10.1531 5.1386 7.4027 9.3240 0.5089 13.6014 6.0038 8.4285 5.6030 3.8309 2.0621 1.1430 4.6968 4.5835 3.4893 1.0054 16.2777 78.6262 11.7735 6.0909 6.9177 24.2219 19.7544 24.3936 69.9543 7.9874 22.1440 44.4287 9.5129 62.8585 42.0918 58.5166 23.4794 228.0836 119.8996 32.7188 17.2277 16.3219 80.0176 133.3074 47.3535 41.3604 44.2045 34.2767 12.0694 76.1863 59.7549 12.7633 5.9675 59.0297 3.8351 16.1351 22.4334 1.2598 3.4453 2.2258 72.9232 68.1047 21.8226 11.2859 24.4796 22.2687 22.6116 27.0868 24.7425 21.2669 14.5918 11.8682 2.3537 9.2866 0.2008 0.4947 4.1068 17.0873 11.2236 16.0337 144.2965 96.5276 132.2605 176.2962 17.0428 65.3541 40.8663 9.3551 2.3115 0.8809 18.2300 6.1322 18.4784 20.4204 19.7957 16.7487 19.6924 14.4759 27.0778 3.8324 38.4188 5.7313 32.0718 0.7689 32.1885 28.7990 0.4288 38.6755 30.4019 12.6088 12.5113 7.1407
temp: 298.150 k
press: 1.00000 atm
elementType: 8 8 8 8 8 8 8 6 6 6 6 6 6 6 6 6 6 6 6 6 6 6 6 6 1 1 1 1 1 1 1 1 1 1 1 1 1 1 1 1 1 1 1 1 1 1 1 1 1 1 1 1
symmnumber: 1
zpe: 1125249.8 jmol-1
zpe.correction: 0.428585 hartree
zpe.thermalcorrener: 0.458294 hartree
zpe.thermalcorrenthalpy: 0.459238 hartree
zpe.thermalcorrgfe: 0.364320 hartree
zpe.sumelectzpe: -1189.260756 hartree
zpe.sumelectthermal: -1189.231047 hartree
zpe.sumelectthermalent: -1189.230102 hartree
zpe.sumelectthermalfe: -1189.325020 hartree
dipole: -1.7262 2.2019 -0.5232
dipole: 2.8464
quadrupole: -158.3756 -137.2127 -139.1953
quadrupole: 4.1361 10.7026 -0.7250
quadrupole: -13.4477 7.7152 5.7325 4.1361 10.7026 -0.7250
hfenergy: -1189.6893406 hartree
pointgroup: C01 [X(C17H28O7)]
dipole: -0.7997059 0.7424337 0.2516468 debye
polarizability: 203.0286822|8.4511288|207.9645581|-2.900872|-5.7151267|202.425069 unknown
InChI: InChI=1S/C17H28O7/c1-5-23-16(21)14(11(3)19)13(9-7-8-10-18)15(12(4)20)17(22)24-6-2/h13-15,18H,5-10H2,1-4H3
charge 0 multiplicity 1
52 atoms
O  0.147134 2.763941 0.351631
O  -2.998187 -0.969257 -0.940168
O  -0.390156 -0.696644 3.582259
O  -0.548715 -3.012381 -0.864051
O  -1.869975 2.042382 1.275581
O  -1.33788 0.585203 -1.436766
O  6.14341 -0.053512 -1.826469
C  0.32142 -0.462477 0.864552
C  1.302722 -0.30654 -0.327607
C  0.224853 0.821328 1.759439
C  -1.08992 -1.022677 0.467438
C  2.786711 -0.334285 0.104029
C  3.74626 -0.189857 -1.099755
C  -0.258564 0.495366 3.196857
C  -0.944341 -2.551563 0.237678
C  -0.628925 1.919424 1.129367
C  -1.76291 -0.361164 -0.736044
C  5.22798 -0.243542 -0.688193
C  -0.531244 1.665866 4.121844
C  -1.253979 -3.425624 1.438033
C  -0.601695 3.751018 -0.496522
C  -3.806673 -0.491148 -2.105148
C  0.443392 4.561918 -1.253986
C  -3.387619 -1.219581 -3.384741
H  0.747602 -1.223296 1.55207
H  1.08563 0.625244 -0.87709
H  1.123864 -1.137758 -1.03661
H  1.252036 1.228623 1.85924
H  -1.776012 -0.88729 1.323823
H  2.998876 0.483945 0.824346
H  2.999726 -1.285012 0.637758
H  3.556191 0.768937 -1.620254
H  3.535418 -0.998808 -1.831456
H  5.446154 -1.199743 -0.163091
H  5.472156 0.587978 -0.004564
H  0.199924 2.481409 3.975753
H  -0.5273 1.330005 5.170151
H  -1.529562 2.078552 3.88092
H  -0.846523 -2.981153 2.364716
H  -0.869669 -4.446294 1.287567
H  -2.353849 -3.472093 1.565779
H  -1.226925 4.373157 0.168855
H  -1.258009 3.166712 -1.16438
H  -3.675195 0.601457 -2.195467
H  -4.842193 -0.725992 -1.811656
H  5.96184 -0.75792 -2.499151
H  1.106203 5.107113 -0.560214
H  1.063097 3.907346 -1.889916
H  -0.060356 5.300139 -1.904306
H  -2.351963 -0.963102 -3.66247
H  -3.456796 -2.312871 -3.25446
H  -4.054763 -0.923877 -4.21585
