program: Gaussian 09
title: 000271469
version: EM64L-G09RevD.01
frameworkgroup: C1[X(C13H22O6)]
method: RPBEPBE
basis: SDD
operation: Freq
keyword: #pfreq=noraman
keyword: PBEPBE/SDD
title: #p freq=noraman PBEPBE/SDD
converged: YES YES NO NO
title: Mulliken charges:
elementType: O O O O O O C C C C C C C C C C C C C H H H H H H H H H H H H H H H H H H H H H H
charge: -0.288718 -0.276003 -0.263422 -0.262439 -0.226521 -0.231429 0.298461 -0.471049 -0.429967 -0.414445 -0.304635 -0.364030 -0.368169 -0.294944 -0.700016 0.247208 0.228482 -0.503902 -0.506274 0.235747 0.262507 0.213829 0.220604 0.236714 0.254797 0.215559 0.214314 0.230297 0.246863 0.235622 0.194246 0.280597 0.207857 0.216272 0.215255 0.235748 0.245072 0.243872 0.236497 0.241361 0.248182
chargesum: 0.00000
title: Mulliken charges with hydrogens summed into heavy atoms:
elementType: O O O O O O C C C C C C C C C C C C C
charge: -0.288718 -0.276003 -0.263422 -0.262439 -0.226521 -0.231429 0.298461 0.027204 0.004466 0.077065 0.125238 0.113130 0.061699 -0.014347 -0.060632 0.247208 0.228482 0.220789 0.219767
polarizability: 1.66754761e+02 -4.14048903e+00 1.75603449e+02 1.15237047e+00 -5.24252608e+00 1.26700257e+02
1716.lowfreq: -20.5414 -5.0859 0.0002 0.0003 0.0005 5.7957 7.6231 15.7516 23.0505
frequency: -20.3009 15.3872 22.9174 35.9942 49.6639 62.6442 74.4347 84.5186 88.8237 94.4425 102.0864 116.8606 139.9840 151.2559 181.2024 198.3714 204.3677 242.4864 249.7354 267.4697 277.0728 312.2543 317.6350 337.2284 352.4336 358.8171 429.3482 468.5963 543.2320 566.0687 647.3586 658.8070 676.2746 700.7696 728.4249 735.6822 754.7688 781.7394 811.0878 837.0526 848.2050 856.3250 886.0412 899.8835 916.6756 923.4828 955.1248 966.4892 978.2494 999.3113 1018.9678 1039.7863 1074.7539 1093.7533 1106.4848 1113.4293 1113.8104 1115.7533 1122.1816 1138.9832 1149.4413 1150.3248 1158.0901 1165.9213 1183.3733 1190.9101 1218.3509 1243.3442 1258.1079 1285.4327 1290.6127 1299.8690 1321.7180 1324.5264 1326.0955 1333.2758 1362.5507 1372.1997 1388.6263 1422.0743 1422.4493 1452.3666 1454.0457 1457.4193 1458.8386 1462.3698 1464.5673 1469.5706 1476.1153 1478.0910 1484.9903 1486.8752 1495.7367 1641.7212 1648.2084 2971.3586 2975.0202 2993.9744 2999.2723 3003.2428 3005.0638 3006.4885 3007.2981 3017.8269 3030.6435 3033.4022 3057.0900 3060.0177 3060.4229 3071.3227 3074.4240 3084.0957 3101.3236 3109.2052 3111.1647 3152.3574 3153.2208
redmass: 2.5580 4.5997 4.1165 4.9826 4.7177 4.0839 2.9607 1.7519 1.6406 1.3175 1.7212 3.4051 3.6570 3.3768 3.7365 4.1281 4.0258 1.3243 2.0068 4.8657 2.4547 3.2905 4.2722 3.2034 3.3337 6.5930 4.3137 4.5826 4.1904 6.4330 3.1525 3.3932 4.5508 4.5237 2.5120 1.9612 2.3226 2.1084 2.9680 3.2051 1.7347 3.0390 1.9893 1.9698 3.0481 4.9100 3.1716 4.2299 3.7271 3.1048 2.7942 2.5527 2.4099 4.1652 1.5438 1.5069 1.3463 1.9439 2.2913 1.6305 1.5027 1.5126 2.3375 1.2904 1.7794 1.1940 1.6168 1.4551 1.5828 1.3038 1.2166 1.4642 1.3654 1.3766 1.2746 1.4486 1.6856 1.4467 1.2145 1.1882 1.1770 1.0502 1.0498 1.0889 1.0803 1.0504 1.0505 1.0853 1.0565 1.0448 1.0878 1.0805 1.0853 8.9895 10.0090 1.0370 1.0614 1.0616 1.0564 1.0606 1.0660 1.0295 1.0297 1.0627 1.0955 1.0818 1.1010 1.1048 1.1022 1.0994 1.1014 1.1019 1.1041 1.1047 1.1048 1.1049 1.1049
irintensity: 7.1140 0.3751 0.1428 0.9141 1.8821 0.0331 1.4002 0.4950 0.4245 0.2025 0.1346 1.5756 2.2458 5.6543 2.2706 4.0110 2.3751 1.5984 8.2176 13.0534 0.4014 9.7644 13.3691 3.8143 2.2198 10.3378 15.0534 19.0876 0.3100 13.2771 3.0478 2.0563 3.9176 0.4997 8.9634 5.6818 6.3375 13.5696 28.3459 22.9978 1.2455 2.2182 15.3818 5.4316 44.0423 23.5710 6.6849 23.9277 1.5707 33.2901 108.9717 8.2461 6.9033 90.3615 8.9518 46.3252 14.3219 57.4393 111.7094 60.9561 27.0010 6.5446 181.5571 9.3885 11.6092 17.0678 46.7050 10.9542 47.0194 24.7273 4.1090 29.6386 9.3372 31.5239 10.3187 47.8955 19.8220 2.8308 8.9750 23.1863 13.2570 13.7871 15.7205 6.5241 3.8337 12.1768 11.4457 21.2182 4.8253 11.1394 3.0152 11.3228 5.2630 144.6872 197.3060 51.6827 18.7560 16.6630 53.1739 30.1790 42.2383 31.2672 28.6077 16.0950 0.7310 5.8940 2.4159 24.9604 7.4883 56.0068 81.3416 31.4207 34.2294 24.8237 22.5705 13.8991 15.2465
temp: 298.150 k
press: 1.00000 atm
elementType: 8 8 8 8 8 8 6 6 6 6 6 6 6 6 6 6 6 6 6 1 1 1 1 1 1 1 1 1 1 1 1 1 1 1 1 1 1 1 1 1 1
symmnumber: 1
zpe: 889551.7 jmol-1
zpe.correction: 0.338812 hartree
zpe.thermalcorrener: 0.360267 hartree
zpe.thermalcorrenthalpy: 0.361211 hartree
zpe.thermalcorrgfe: 0.285310 hartree
zpe.sumelectzpe: -958.383140 hartree
zpe.sumelectthermal: -958.361685 hartree
zpe.sumelectthermalent: -958.360741 hartree
zpe.sumelectthermalfe: -958.436642 hartree
dipole: 2.0946 0.7810 -0.6959
dipole: 2.3413
quadrupole: -106.7029 -96.2991 -119.0373
quadrupole: -1.1296 -2.5769 -1.6951
quadrupole: 0.6435 11.0474 -11.6909 -1.1296 -2.5769 -1.6951
hfenergy: -958.7219521 hartree
pointgroup: C01 [X(C13H22O6)]
dipole: -0.8497012 0.0078714 0.355554 debye
polarizability: 164.6846627|1.1488398|176.8005911|-4.1735029|6.9534286|127.5732137 unknown
InChI: InChI=1S/C13H22O6/c1-4-6-13(18-8-9-19-13)7-5-10(11(14)16-2)12(15)17-3/h10H,4-9H2,1-3H3
charge 0 multiplicity 1
41 atoms
O  2.874861 -0.104501 -1.438738
O  2.709058 -1.140343 0.668285
O  -2.43432 1.887853 0.602338
O  -3.11234 -2.050343 0.839942
O  -2.533264 0.366363 -1.159749
O  -0.928344 -2.58078 0.244019
C  2.271802 0.053926 -0.08305
C  0.733881 0.071698 -0.239983
C  2.899107 1.27365 0.602097
C  0.000633 0.058616 1.118676
C  3.210278 -1.540362 -1.620211
C  2.720556 -2.238016 -0.323628
C  2.603088 2.61738 -0.100575
C  -1.51482 -0.282383 1.020094
C  3.381856 3.785049 0.541843
C  -2.221991 0.637396 0.019467
C  -1.768753 -1.74584 0.644534
C  -3.050511 2.909577 -0.281679
C  -3.530417 -3.419763 0.450627
H  0.455262 0.958098 -0.838731
H  0.437858 -0.812818 -0.829005
H  2.552613 1.306607 1.653448
H  3.990388 1.097764 0.627653
H  0.09181 1.040186 1.619125
H  0.479707 -0.69718 1.768136
H  2.70123 -1.920163 -2.524199
H  4.305163 -1.618057 -1.748024
H  3.416827 -3.002049 0.055244
H  1.707544 -2.669329 -0.430858
H  2.871865 2.527096 -1.17001
H  1.517104 2.836726 -0.059935
H  -1.983439 -0.107768 2.006114
H  3.124615 3.896462 1.612566
H  3.158649 4.743814 0.038733
H  4.472825 3.614791 0.476062
H  -3.08112 3.823806 0.326839
H  -4.064742 2.592195 -0.575977
H  -2.437503 3.050593 -1.187523
H  -4.60465 -3.459148 0.676957
H  -2.970674 -4.169986 1.033877
H  -3.343792 -3.577015 -0.624597
