program: Gaussian 09
title: 000271462
version: EM64L-G09RevD.01
frameworkgroup: C1[X(C8H12Cl2O)]
method: RPBEPBE
basis: SDD
operation: Freq
keyword: #p
keyword: freq=noraman
keyword: PBEPBE/SDD
title: #p freq=noraman PBEPBE/SDD
converged: NO YES NO NO
title: Mulliken charges:
elementType: Cl Cl O C C C C C C C C H H H H H H H H H H H H
charge: 0.025196 0.005632 -0.165572 0.287736 -0.431870 -0.421169 -0.398445 0.156970 -0.520805 -0.685841 -0.700082 0.240994 0.219173 0.203837 0.222764 0.224685 0.215651 0.228437 0.250150 0.342707 0.222481 0.231218 0.246153
chargesum: 0.00000
title: Mulliken charges with hydrogens summed into heavy atoms:
elementType: Cl Cl O C C C C C C C C
charge: 0.025196 0.005632 -0.165572 0.287736 0.028296 0.005432 0.041891 0.156970 -0.042218 -0.343134 -0.000229
polarizability: 1.09254953e+02 2.83664274e+00 1.11953062e+02 2.55643965e+00 7.18678992e-01 8.81304161e+01
1716.lowfreq: -14.8868 -13.5508 -0.0032 -0.0031 -0.0022 11.6375 52.5585 81.1143 120.0364
frequency: 52.2140 81.0983 120.0167 136.0284 166.8323 217.2936 224.0579 243.1789 290.4387 304.3244 345.7998 364.0653 417.3818 447.7090 505.7454 545.1751 642.9756 680.8276 694.2550 707.0492 801.4630 830.7181 846.9072 901.4028 902.6423 941.2726 986.5483 1034.3002 1065.0030 1092.6179 1108.8647 1114.0270 1140.1512 1184.6000 1201.9018 1225.6038 1245.7042 1253.2159 1273.4436 1297.6892 1334.4463 1338.5387 1344.3327 1393.2719 1455.4312 1458.6009 1465.4087 1472.8459 1475.4506 1480.9762 1635.7068 2979.6990 2984.9351 2986.0714 2988.4145 3007.2995 3038.3651 3049.4115 3056.2998 3079.8602 3107.7298 3112.9828 3133.4767
redmass: 7.3333 6.4087 4.6864 3.9547 1.0928 4.7966 3.5420 4.1300 6.9047 2.4906 2.5695 3.1442 3.6110 3.8208 2.0631 3.6828 5.1545 4.3100 3.1823 4.7826 1.6806 2.3753 2.6343 2.3467 1.5782 1.9384 1.9243 1.6646 1.7407 1.4891 2.2109 1.6975 2.3574 2.1235 1.1267 1.7563 1.3280 1.3736 1.4355 1.3082 1.5024 1.4045 1.4661 1.1953 1.0633 1.0910 1.0653 1.0750 1.0572 1.0877 10.2228 1.0651 1.0660 1.0617 1.0606 1.0357 1.0955 1.1013 1.1026 1.0977 1.1003 1.0996 1.0882
irintensity: 0.2719 2.2964 0.5578 0.8045 0.0494 2.9368 2.5560 3.6068 1.1629 2.1529 0.7441 2.5544 2.8431 3.5665 4.9991 18.7642 46.1018 11.2366 4.5372 73.1774 39.9626 10.6205 4.9317 31.8585 13.6231 10.1314 21.0886 4.9019 22.5613 0.0368 8.0720 11.1635 15.6672 1.0595 8.2537 17.4595 3.0138 0.8342 20.9884 12.5182 2.0433 0.3856 0.0707 26.3153 3.9056 17.4599 20.7081 3.7096 28.3786 9.3467 140.0033 24.8538 2.3311 26.6018 35.1808 16.4449 43.0262 21.9545 37.5294 22.3049 13.5503 11.2091 6.2188
temp: 298.150 k
press: 1.00000 atm
elementType: 17 17 8 6 6 6 6 6 6 6 6 1 1 1 1 1 1 1 1 1 1 1 1
symmnumber: 1
zpe: 484571.9 jmol-1
zpe.correction: 0.184564 hartree
zpe.thermalcorrener: 0.196280 hartree
zpe.thermalcorrenthalpy: 0.197224 hartree
zpe.thermalcorrgfe: 0.146521 hartree
zpe.sumelectzpe: -1306.525891 hartree
zpe.sumelectthermal: -1306.514174 hartree
zpe.sumelectthermalent: -1306.513230 hartree
zpe.sumelectthermalfe: -1306.563934 hartree
dipole: -2.4738 3.0813 -1.1744
dipole: 4.1223
quadrupole: -82.4485 -86.6642 -78.4393
quadrupole: -5.0965 4.1534 3.1613
quadrupole: 0.0688 -4.1468 4.0780 -5.0965 4.1534 3.1613
hfenergy: -1306.7104545 hartree
pointgroup: C01 [X(C8H12Cl2O1)]
dipole: 1.1526515 1.1196191 0.2194147 debye
dipolederiv: -0.3168367 -0.1882693 0.1559043 -0.149124 -0.5007164 0.2009035 0.1317002 0.1858477 -0.2501796 -0.4618541 0.345341 0.0280395 0.3035233 -0.5756406 0.0254927 0.0176036 0.0525271 -0.1661142 -0.4512711 0.12096 -0.0666688 0.1639216 -0.8000935 -0.2386552 -0.1173079 -0.2948013 -0.4557406 -0.3028748 0.1868192 0.0566423 0.1785478 -0.4106778 0.0484665 -0.0143683 0.0301803 -0.0490687 0.0447782 0.0822405 -0.0414932 0.0911062 0.1405823 -0.0410254 0.0102176 0.0024421 0.0377029 0.0451923 -0.0356776 -0.0607072 -0.0518124 0.0150281 0.0001894 -0.032962 0.0508246 0.1023326 0.1498278 0.0446877 -0.0155596 0.0928455 0.14286 0.0609514 -0.0838241 -0.0183128 0.0995579 0.7503569 -0.2819492 0.2806178 -0.3897966 0.9285099 0.2964108 0.4591125 0.2934507 0.4220961 -0.1774574 -0.1279399 -0.2227701 -0.0880007 -0.1125452 -0.0580044 -0.2317384 -0.0431337 -0.057741 0.8237375 -0.1886136 -0.2608269 -0.2004113 1.1238334 -0.2437983 -0.337648 -0.1955195 0.4254211 -0.0522685 -0.03429 -0.0119754 -0.0371522 0.0255079 -0.0206697 -0.0203608 -0.0255221 -0.0445395 -0.0055057 0.0892383 -0.0721453 0.0613721 -0.0491753 0.0486489 -0.0562055 0.0162496 0.0759063 0.0028191 -0.0214868 0.1049585 -0.0180474 0.0455628 -0.0631782 0.0724831 -0.0293692 -0.0891953 -0.0031639 0.0787878 0.0814801 0.0597366 0.0615858 -0.0271247 0.0687051 -0.0757079 -0.1247928 -0.02456 -0.1122264 0.0178366 -0.1049547 -0.1048832 0.0511261 0.0295977 0.0728586 0.055231 -0.0743266 -0.0399002 -0.1174289 -0.0671564 0.0277032 -0.0392513 -0.1542433 -0.0276028 -0.0415215 0.0046201 0.0128234 0.0753117 0.0310261 0.0183171 -0.0253799 0.1534042 -0.0204398 -0.0697646 0.0090926 -0.0092021 0.1077986 0.0135852 0.0875579 -0.0544503 0.0934103 -0.025954 -0.0530721 -0.0122073 0.0683347 -0.0432658 0.0966273 -0.0657209 0.0444656 -0.014896 0.0039613 0.0752479 -0.0148037 -0.009582 -0.0486394 0.0008745 -0.0489664 -0.0022736 -0.0342555 0.0068532 -0.0319162 0.0259843 0.0677512 -0.0593433 0.106424 -0.0332021 0.0712864 -0.0383023 0.0113712 0.0814806 0.0174706 0.0255642 0.1172406 0.0138308 0.0962916 -0.0441295 0.0785868 -0.026288 -0.0307053 0.0232505 -0.0734111 -0.0050063 -0.1069651 -0.0117187 0.0099993 0.0212908 0.0560847 0.0893748 unknown
polarizability: 108.9579438|-2.6617187|112.3516544|-0.6472037|-2.0602768|88.0288321 unknown
InChI: InChI=1S/C8H12Cl2O/c1-8(7(9)10)5-3-2-4-6(8)11/h7H,2-5H2,1H3
charge 0 multiplicity 1
23 atoms
Cl -2.08946 -1.174186 1.366883
Cl -2.43626 1.734412 0.473953
O  0.67364 -2.164499 -0.85645
C  -0.368703 0.045301 -0.528158
C  0.500028 1.305415 -0.904007
C  1.565095 1.68505 0.150965
C  2.504969 0.497434 0.459795
C  0.656938 -1.096038 -0.199245
C  1.706913 -0.779041 0.862327
C  -1.186149 0.348971 0.741462
C  -1.262642 -0.360311 -1.715848
H  -0.182531 2.152942 -1.100356
H  1.004446 1.067904 -1.861557
H  1.081456 2.03863 1.083663
H  2.156485 2.540227 -0.22751
H  3.210422 0.758588 1.270285
H  3.113225 0.266879 -0.437011
H  1.216275 -0.612718 1.842349
H  2.372978 -1.652342 0.964424
H  -0.589835 0.690262 1.595165
H  -1.911243 0.480771 -2.014392
H  -0.63128 -0.651829 -2.57143
H  -1.894567 -1.226922 -1.462106
