program: Gaussian 09
title: 000271457
version: EM64L-G09RevD.01
frameworkgroup: C1[X(C12H13NO)]
method: RPBEPBE
basis: SDD
operation: Freq
keyword: #p
keyword: freq=noraman
keyword: PBEPBE/SDD
title: #p freq=noraman PBEPBE/SDD
converged: YES YES NO NO
title: Mulliken charges:
elementType: O N C C C C C C C C C C C C H H H H H H H H H H H H H
charge: -0.207731 -0.393405 -0.216567 -0.250835 -0.438122 0.265834 -0.403254 0.173690 -0.498975 0.222909 -0.430728 -0.388762 -0.267321 -0.209387 0.247238 0.258278 0.198218 0.218685 0.217814 0.234409 0.215748 0.249046 0.298910 0.228202 0.232858 0.222082 0.221164
chargesum: 0.00000
title: Mulliken charges with hydrogens summed into heavy atoms:
elementType: O N C C C C C C C C C C C C
charge: -0.207731 -0.094495 0.030671 0.007443 -0.021219 0.265834 0.048968 0.173690 -0.034180 0.222909 -0.202526 -0.155904 -0.045239 0.011778
polarizability: 1.56437513e+02 -4.55418060e-01 1.36900514e+02 1.71024997e+01 -1.34087901e-01 9.15887200e+01
1716.lowfreq: -13.4133 -0.0006 -0.0004 0.0004 11.7633 14.1425 62.2631 76.2122 125.9385
frequency: 62.1763 76.2022 125.9323 170.1582 240.3681 276.8892 309.0202 349.6918 412.1790 419.8194 450.5166 513.4844 517.1673 531.9794 542.1859 580.6014 620.1164 656.1151 691.5015 729.0155 741.6857 754.7120 820.6384 850.9090 858.0546 865.1878 871.2448 902.1692 928.2877 964.8553 967.6185 1018.7419 1026.6541 1039.3607 1074.6661 1078.4598 1100.7900 1111.0931 1148.8151 1164.7108 1168.5911 1199.2365 1221.9424 1248.2446 1260.5026 1278.9229 1284.5873 1299.9038 1308.2388 1313.1773 1338.6727 1358.4101 1372.1325 1421.5855 1444.0387 1457.0561 1467.4997 1470.3294 1481.3747 1602.6742 1622.4378 1623.8776 2949.1635 2969.6660 2978.4270 2988.3079 2995.9712 3035.2576 3057.1446 3072.7479 3117.2102 3127.5044 3145.2369 3162.6995 3503.4429
redmass: 7.0509 3.6193 3.7173 3.0432 4.4348 2.4421 3.2051 4.0291 2.4942 2.8681 3.4001 5.1445 2.6817 3.7995 3.6551 3.1310 3.6412 2.7228 3.5145 3.9405 1.8053 1.9592 2.3001 1.8609 2.0840 2.0756 2.4025 2.5013 1.4100 2.4728 1.3973 2.1685 2.3448 1.7816 2.2654 2.8484 1.2327 1.6577 1.8014 1.7653 1.1526 1.5009 1.3608 1.4762 1.3759 1.6815 1.6064 1.5704 1.9013 1.5015 1.4250 1.4529 2.1928 2.5853 1.0930 2.6040 1.0836 1.0932 3.0589 6.6900 9.4765 7.8962 1.0806 1.0656 1.0666 1.0817 1.0619 1.0975 1.1026 1.0968 1.0875 1.0879 1.0937 1.1000 1.0761
irintensity: 1.3118 2.1459 1.7010 0.7919 2.5551 0.3337 22.5758 0.8576 2.4649 5.6228 12.8721 6.6872 37.8416 10.5604 1.5103 49.3711 47.8533 32.0446 33.9358 9.0992 33.0473 69.8269 3.5167 2.4880 8.7568 4.0448 4.8401 22.2737 1.8754 10.9946 0.6391 7.9443 0.4397 13.4687 4.1486 12.1809 10.4710 14.6067 1.7924 4.0927 4.0758 38.0846 0.0270 7.4885 6.3498 0.3221 10.4091 10.9487 9.6268 9.4179 0.6506 4.6831 40.3389 2.7758 17.6465 50.3441 13.8167 14.0322 60.8198 6.7960 137.7678 52.4244 18.7402 7.6502 37.4235 63.1188 22.0427 30.6724 48.7215 18.8113 8.2249 8.6044 28.2233 27.4478 32.4327
temp: 298.150 k
press: 1.00000 atm
elementType: 8 7 6 6 6 6 6 6 6 6 6 6 6 6 1 1 1 1 1 1 1 1 1 1 1 1 1
symmnumber: 1
zpe: 585631.8 jmol-1
zpe.correction: 0.223055 hartree
zpe.thermalcorrener: 0.233984 hartree
zpe.thermalcorrenthalpy: 0.234928 hartree
zpe.thermalcorrgfe: 0.186322 hartree
zpe.sumelectzpe: -594.043249 hartree
zpe.sumelectthermal: -594.032320 hartree
zpe.sumelectthermalent: -594.031376 hartree
zpe.sumelectthermalfe: -594.079982 hartree
dipole: 1.5844 2.4163 1.0342
dipole: 3.0689
quadrupole: -77.4767 -80.5911 -85.5524
quadrupole: 6.3463 6.2444 -2.7471
quadrupole: 3.7300 0.6156 -4.3456 6.3463 6.2444 -2.7471
hfenergy: -594.266304 hartree
pointgroup: C01 [X(C12H13N1O1)]
dipole: -0.5795557 -0.9798046 0.402437 debye
polarizability: 156.3211712|0.515817|136.9044428|-17.3119859|-0.3216666|91.701133 unknown
InChI: InChI=1S/C12H13NO/c14-11-7-3-5-9-8-4-1-2-6-10(8)13-12(9)11/h1-2,4,6,9,12-13H,3,5,7H2
charge 0 multiplicity 1
27 atoms
O  -2.084117 1.932684 -0.897894
N  -0.005433 1.571533 0.903884
C  -0.499959 -0.776297 1.072611
C  -1.164433 0.645046 0.959011
C  -1.371559 -1.939595 0.545028
C  0.844458 -0.53696 0.382806
C  -2.025181 -1.630547 -0.818157
C  -2.072343 0.829595 -0.288128
C  -2.91434 -0.360171 -0.715019
C  1.089716 0.865409 0.348415
C  1.811393 -1.438801 -0.084872
C  2.303415 1.380152 -0.155242
C  3.033884 -0.935332 -0.605986
C  3.268836 0.460363 -0.634663
H  -0.296141 -0.95617 2.149754
H  -1.798364 0.849387 1.845425
H  -2.168316 -2.162293 1.283747
H  -0.749289 -2.85213 0.473787
H  -2.643564 -2.484831 -1.150084
H  -1.243871 -1.474291 -1.58652
H  -3.700754 -0.538343 0.048858
H  -3.415902 -0.117947 -1.667688
H  -0.212532 2.512128 0.551688
H  1.631218 -2.520392 -0.054367
H  2.495893 2.458176 -0.182606
H  3.795438 -1.625821 -0.983568
H  4.214646 0.840749 -1.037819
