program: Gaussian 09
title: 000271434
version: EM64L-G09RevD.01
frameworkgroup: C1[X(C22H22N2O)]
method: RPBEPBE
basis: SDD
operation: Freq
keyword: #p
keyword: freq=noraman
keyword: PBEPBE/SDD
title: #p freq=noraman PBEPBE/SDD
converged: YES YES NO NO
title: Mulliken charges:
elementType: O N N C C C C C C C C C C C C C C C C C C C C C C H H H H H H H H H H H H H H H H H H H H H H
charge: -0.305139 -0.223303 -0.500655 0.321193 0.046354 -0.539331 0.266453 0.174190 -0.347231 0.224093 -0.589038 -0.477354 0.125730 -0.341872 -0.390586 0.523714 -0.394388 -0.260506 -0.693807 -0.205455 -0.359670 -0.449393 -0.235938 -0.227672 -0.242732 0.266493 0.204981 0.210334 0.202077 0.305779 0.289051 0.221639 0.253778 0.199103 0.193014 0.241315 0.234639 0.227118 0.221097 0.214429 0.212490 0.224645 0.271840 0.227323 0.227716 0.224827 0.228655
chargesum: 0.00000
title: Mulliken charges with hydrogens summed into heavy atoms:
elementType: O N N C C C C C C C C C C C C C C C C C C C C C C
charge: -0.305139 -0.223303 -0.194876 0.321193 0.046354 -0.067857 0.266453 0.174190 0.065180 0.224093 -0.078348 -0.223576 0.125730 0.050245 -0.149272 0.523714 -0.159749 -0.033389 -0.045791 0.019190 -0.087830 -0.222070 -0.008222 -0.002846 -0.014078
polarizability: 3.76168634e+02 1.27904399e+01 2.51940202e+02 9.58561273e+00 -2.46170172e+01 1.82584004e+02
1716.lowfreq: -4.6330 -0.0009 -0.0009 -0.0005 4.6459 6.2515 22.2200 27.4764 32.0392
frequency: 22.1757 27.2593 32.0088 46.4717 51.1432 67.7726 92.2302 93.9998 120.1576 140.9155 162.1208 195.8746 206.6605 220.6156 230.2208 256.1847 267.7624 312.6106 323.5711 369.0173 377.4773 389.7239 403.1713 403.5924 414.9041 430.3210 442.2500 468.3504 512.1124 538.1721 562.6604 583.5464 599.1621 613.8017 617.2732 651.2667 658.7226 677.9247 704.2926 723.3670 729.7568 734.7921 754.4220 768.3978 771.2352 788.6041 812.8485 826.9772 849.9320 854.3309 855.0121 861.0009 888.9221 898.4520 914.2401 926.2144 942.9223 972.8240 976.5173 977.0403 989.4228 996.3573 998.3425 1015.1259 1025.7524 1037.5115 1065.7675 1087.4658 1102.0949 1104.6544 1108.0922 1123.8034 1169.3876 1169.7584 1172.4527 1189.8883 1207.5739 1210.0156 1216.2813 1240.6050 1255.4565 1261.1572 1270.6926 1280.1684 1287.0156 1290.4494 1313.7971 1325.1220 1339.8192 1348.6383 1350.8177 1377.3080 1385.8274 1393.4156 1411.3531 1426.4099 1442.3734 1450.9651 1461.4256 1467.9847 1474.6900 1477.9980 1482.1559 1483.7527 1486.0821 1496.3213 1556.7310 1586.7811 1593.6576 1598.3302 1614.4817 1632.4128 1674.5953 2962.8064 2972.5488 2976.1053 2982.6611 2997.0818 3003.3472 3031.5812 3060.7681 3067.2657 3072.9196 3075.7740 3103.7632 3126.3513 3128.1110 3138.0850 3138.2130 3149.3343 3150.5968 3164.1478 3167.1288 3179.5838 3625.4400
redmass: 4.8292 4.7917 3.8523 3.8644 4.3681 1.5833 5.4493 6.2898 2.8207 3.7421 4.3300 4.7255 4.3874 2.7665 1.2532 4.8699 5.0767 3.5756 4.1854 5.7125 2.6276 2.6149 1.3435 2.4096 5.3322 3.2157 3.3317 3.9024 5.8498 4.5887 4.1722 4.9309 5.0648 5.6817 6.1869 4.1005 5.1505 5.5990 2.0620 1.5782 1.7985 2.2050 1.6318 2.6982 2.7200 1.4665 3.8512 4.7496 2.6730 1.3732 1.2722 1.6706 2.7194 1.7424 1.9841 1.4361 1.3964 2.0726 1.4009 1.3154 4.6168 2.3298 1.9542 2.0431 2.3617 2.7697 2.6227 1.8096 2.0049 2.1314 1.7187 2.8746 2.6580 1.1127 1.0555 1.1157 1.7083 2.4007 1.9396 1.6930 1.3088 1.5588 1.5293 2.0564 1.5973 1.1449 1.5634 1.4478 1.5291 1.5800 1.9168 2.2644 5.2243 1.2118 3.6301 2.3848 2.1598 1.2815 3.1666 1.0689 1.0877 1.0418 3.0500 1.9064 1.1811 1.1132 8.2552 6.2825 6.0822 7.9712 5.9878 7.6544 8.9432 1.0591 1.0604 1.0371 1.0657 1.0617 1.0987 1.1006 1.0977 1.0987 1.1005 1.0994 1.0882 1.0861 1.0855 1.0891 1.0914 1.0955 1.0956 1.1013 1.1001 1.0923 1.0799
irintensity: 1.2026 0.2680 0.0258 0.2106 0.9843 0.0982 1.1048 2.3133 0.0441 0.2113 0.2277 1.4066 0.8295 0.4490 0.0364 1.6518 0.6966 1.6670 1.4572 5.0309 5.9254 4.1312 73.9902 10.7937 0.4010 4.4243 3.9882 3.3950 13.6846 7.1602 0.9869 3.0734 8.0753 5.8968 0.9562 6.4063 3.7880 2.0414 28.3094 61.6609 2.3423 34.7366 69.1315 2.9870 27.8774 4.1254 4.1644 2.0126 7.2615 7.8061 2.4064 15.9682 4.4940 2.1978 14.8873 0.2796 2.3456 7.4920 0.1978 0.0251 0.3655 3.3748 2.4503 4.4866 6.5230 4.5647 2.2098 18.7986 17.8909 16.2698 0.2589 33.5643 7.7478 8.5187 0.1546 4.6205 3.7064 5.3078 12.1577 47.7114 2.4660 6.6447 7.3160 15.8250 3.0251 0.1100 8.0331 6.2822 6.5784 6.5309 78.6835 64.7063 1.7133 12.1484 29.6846 28.6213 11.5955 74.3427 74.6475 1.0629 7.3466 12.7712 26.9556 44.5800 9.7641 9.9622 270.7459 134.7274 0.5061 127.8299 9.2113 63.2349 180.7526 18.2451 11.0965 39.6436 50.8393 43.8364 1.3493 25.3995 12.9116 15.0903 75.9409 47.5229 16.5799 0.9528 1.5766 2.4749 21.3362 26.0649 22.9260 26.4897 33.4487 1.0461 41.2247
temp: 298.150 k
press: 1.00000 atm
elementType: 8 7 7 6 6 6 6 6 6 6 6 6 6 6 6 6 6 6 6 6 6 6 6 6 6 1 1 1 1 1 1 1 1 1 1 1 1 1 1 1 1 1 1 1 1 1 1
symmnumber: 1
zpe: 1010350.8 jmol-1
zpe.correction: 0.384822 hartree
zpe.thermalcorrener: 0.406746 hartree
zpe.thermalcorrenthalpy: 0.407690 hartree
zpe.thermalcorrgfe: 0.331964 hartree
zpe.sumelectzpe: -1034.533537 hartree
zpe.sumelectthermal: -1034.511613 hartree
zpe.sumelectthermalent: -1034.510669 hartree
zpe.sumelectthermalfe: -1034.586395 hartree
dipole: -0.5932 5.5960 -3.5577
dipole: 6.6577
quadrupole: -133.5170 -143.9781 -153.5286
quadrupole: 6.1666 -2.0089 5.0556
quadrupole: 10.1576 -0.3035 -9.8540 6.1666 -2.0089 5.0556
hfenergy: -1034.9183589 hartree
pointgroup: C01 [X(C22H22N2O1)]
dipole: 0.2775029 2.1338108 1.4935509 debye
polarizability: 375.807551|-15.1074852|250.11043|8.3144102|27.5096047|184.774859 unknown
InChI: InChI=1S/C22H22N2O/c1-2-3-13-20-22-18(17-11-7-8-12-19(17)23-22)14-21(25)24(20)15-16-9-5-4-6-10-16/h4-12,14,23H,2-3,13,15H2,1H3
charge 0 multiplicity 1
47 atoms
O  -0.905904 -2.33007 -2.339657
N  -0.81203 -0.385775 -0.992881
N  2.137348 1.031875 0.825765
C  -0.140537 0.515164 -0.161136
C  1.215895 0.290208 0.049027
C  -0.856505 1.707776 0.440327
C  1.918324 -0.820635 -0.557813
C  3.308607 -0.725222 -0.113732
C  -0.807042 2.979696 -0.456792
C  3.401106 0.429094 0.739204
C  -2.263113 -0.220389 -1.297732
C  1.229166 -1.707073 -1.38103
C  -0.185124 -1.54657 -1.626536
C  -1.50914 4.189444 0.199982
C  4.458782 -1.506558 -0.36302
C  -3.198509 -0.713789 -0.198438
C  4.619914 0.808383 1.341847
C  5.681588 -1.133709 0.235291
C  -1.467748 5.453706 -0.684848
C  5.755331 0.011413 1.077325
C  -3.051865 -2.019587 0.336197
C  -4.25613 0.106446 0.267094
C  -3.943503 -2.488227 1.325113
C  -5.153934 -0.364896 1.252352
C  -4.996622 -1.66337 1.787808
H  -1.906148 1.456155 0.671219
H  -0.38723 1.945015 1.416189
H  0.248753 3.234295 -0.678944
H  -1.281331 2.764674 -1.435365
H  1.919723 1.863787 1.367037
H  -2.419259 -0.830771 -2.207548
H  -2.467941 0.836475 -1.539014
H  1.709164 -2.560934 -1.864952
H  -2.563209 3.924895 0.422473
H  -1.03149 4.404568 1.178085
H  4.402986 -2.388165 -1.010852
H  4.6908 1.686654 1.992518
H  6.583183 -1.72769 0.053403
H  -1.974509 6.304915 -0.194842
H  -1.968053 5.276108 -1.655172
H  -0.425332 5.757302 -0.896696
H  6.715203 0.281615 1.531978
H  -2.25389 -2.666657 -0.043758
H  -4.3863 1.113936 -0.150831
H  -3.824031 -3.500038 1.728739
H  -5.970221 0.277907 1.60121
H  -5.689226 -2.030787 2.553404
