program: Gaussian 09
title: 000271429
version: EM64L-G09RevD.01
frameworkgroup: C1[X(C18H18N2O4)]
method: RPBEPBE
basis: SDD
operation: Freq
keyword: #p
keyword: freq=noraman
keyword: PBEPBE/SDD
title: #p freq=noraman PBEPBE/SDD
converged: YES YES NO NO
title: Mulliken charges:
elementType: O O O O N N C C C C C C C C C C C C C C C C C C H H H H H H H H H H H H H H H H H H
charge: -0.275700 -0.239691 -0.253996 -0.435498 -0.374206 -0.138489 -0.151777 -0.618422 0.541134 0.198439 0.156730 -0.395940 -0.371416 0.252271 0.061497 -0.358257 -0.387430 0.279854 -0.360248 -0.335997 -0.257563 -0.222851 -0.219343 -0.670663 0.296362 0.228455 0.263032 0.358991 0.225705 0.255456 0.251208 0.218448 0.250985 0.246274 0.236131 0.229721 0.228277 0.224961 0.221414 0.245657 0.243175 0.353306
chargesum: 0.00000
title: Mulliken charges with hydrogens summed into heavy atoms:
elementType: O O O O N N C C C C C C C C C C C C C C C C C C
charge: -0.275700 -0.239691 -0.253996 -0.082192 -0.015215 -0.138489 0.144585 -0.126935 0.541134 0.198439 0.156730 -0.170235 -0.115961 0.252271 0.061497 -0.107049 -0.168982 0.279854 -0.109263 -0.089722 0.208290 0.005426 0.005618 0.039584
polarizability: 3.30733054e+02 -7.83289620e+00 2.21473898e+02 -2.08457964e+00 -3.34966546e+01 1.31106201e+02
1716.lowfreq: -3.9092 -0.0009 -0.0008 -0.0005 4.7551 7.6496 12.7135 24.6759 35.2460
frequency: 12.1480 24.5706 35.2175 41.2869 49.9825 52.6906 73.8731 86.6449 97.8816 126.5444 138.8490 185.8755 200.4123 242.9378 244.2465 260.1262 278.7991 309.3718 316.4205 339.0774 358.2046 377.8228 403.4462 410.2699 413.8802 425.8779 437.9464 489.1623 519.7001 528.6975 547.4561 576.5780 600.3351 608.7402 634.6156 637.9107 667.8458 699.7699 716.5157 722.6250 741.2322 753.3977 767.1641 780.7324 807.1038 813.0396 820.6618 823.4276 840.0733 853.1005 857.4082 861.4419 909.8098 928.1404 941.9858 960.3120 971.1551 986.3887 991.5486 1003.6170 1005.8498 1015.2584 1085.7441 1097.6782 1099.8410 1105.3899 1138.4624 1144.2812 1154.4268 1160.5102 1163.6430 1173.6017 1180.2475 1192.0650 1222.9259 1241.2091 1247.3265 1278.4453 1279.6619 1291.3034 1311.5637 1328.3927 1342.5564 1364.7387 1393.5427 1393.7020 1400.5650 1429.4508 1442.7041 1454.7408 1458.2438 1459.7144 1465.5108 1470.5850 1486.3121 1505.2718 1585.8803 1600.1710 1616.9486 1623.8483 1628.1401 1663.9316 2994.2328 3001.4077 3033.8696 3042.3778 3065.3164 3089.0173 3097.9492 3108.8866 3121.1093 3124.5812 3134.2941 3136.2190 3154.3910 3167.4298 3170.9564 3179.4152 3534.4594 3581.8823
redmass: 5.7326 4.4321 4.6555 4.5026 4.5471 5.0694 4.2330 4.5169 4.5218 6.1791 5.4852 3.7814 3.6946 3.3651 3.3674 2.5027 5.4441 2.6906 2.8864 6.0457 1.1151 4.8265 3.5132 3.5477 3.1988 3.3602 4.2042 5.2013 3.4748 4.3510 1.3367 2.6641 4.7805 7.1130 5.3534 6.3456 9.6732 4.6731 3.8516 4.7001 2.8063 1.5403 4.4573 2.5010 2.1721 1.6563 2.6266 1.6713 3.7434 1.3815 2.5019 7.2695 4.7040 1.3809 1.4317 1.3607 1.2958 3.3013 2.5106 2.0584 2.7761 3.1901 2.6887 2.0005 1.5248 4.3824 1.9672 1.3999 1.5426 1.4716 1.3131 1.9824 1.2133 2.0287 2.2001 2.7050 3.0408 1.1311 1.5032 1.5401 1.2435 1.2244 1.3640 1.5830 5.3292 1.2623 3.6863 2.7909 3.7912 2.5834 1.1030 1.7730 1.0419 1.1242 1.0518 2.7739 7.5072 6.4317 8.2712 7.8948 6.3987 10.9094 1.0359 1.0595 1.0603 1.0855 1.1029 1.0980 1.1019 1.0878 1.0899 1.1068 1.0967 1.0860 1.0912 1.0951 1.0955 1.0991 1.0777 1.0660
irintensity: 0.3831 0.3442 0.1328 0.7275 0.3135 1.7916 0.9432 1.6530 1.1163 1.9328 1.4022 1.1864 0.0749 2.8604 3.1420 2.0652 1.3129 0.9001 32.1429 1.1799 141.4993 12.4846 3.3581 2.8962 2.5264 12.8863 4.7635 12.6482 19.4619 4.3632 100.2851 15.5419 8.4454 0.6467 2.6467 2.0846 1.8464 1.1215 4.4409 19.4613 23.0582 95.9198 23.8874 10.1490 18.0157 14.8529 9.5440 11.2709 21.7555 0.3332 14.5255 15.3912 85.8946 5.0268 6.2688 0.1586 0.0311 10.1718 7.0214 27.3041 2.7440 32.5057 3.3869 46.0829 47.2271 34.8478 113.9520 166.4930 72.8003 43.7426 4.5683 180.7966 11.2787 60.8403 6.2142 110.4190 32.0112 8.6571 28.6149 31.7433 10.1442 10.2089 28.4216 25.8322 18.8791 23.4286 0.2256 19.0382 87.3494 16.8150 12.2540 89.9446 13.1949 15.9953 19.0751 108.7869 302.5414 14.3429 189.4614 8.7987 24.7775 714.0251 15.1862 13.8278 29.1945 14.2594 6.7945 34.8470 4.9351 17.8540 19.4754 22.3422 6.8511 4.0783 17.1689 7.9149 14.3348 12.6958 198.7416 41.3337
temp: 298.150 k
press: 1.00000 atm
elementType: 8 8 8 8 7 7 6 6 6 6 6 6 6 6 6 6 6 6 6 6 6 6 6 6 1 1 1 1 1 1 1 1 1 1 1 1 1 1 1 1 1 1
symmnumber: 1
zpe: 859805.6 jmol-1
zpe.correction: 0.327483 hartree
zpe.thermalcorrener: 0.349373 hartree
zpe.thermalcorrenthalpy: 0.350317 hartree
zpe.thermalcorrgfe: 0.273233 hartree
zpe.sumelectzpe: -1105.388406 hartree
zpe.sumelectthermal: -1105.366516 hartree
zpe.sumelectthermalent: -1105.365572 hartree
zpe.sumelectthermalfe: -1105.442656 hartree
dipole: 1.6967 0.1451 -1.2965
dipole: 2.1403
quadrupole: -129.1216 -129.8839 -138.8624
quadrupole: -7.3668 -6.4854 -6.1662
quadrupole: 3.5010 2.7387 -6.2397 -7.3668 -6.4854 -6.1662
hfenergy: -1105.715889 hartree
pointgroup: C01 [X(C18H18N2O4)]
dipole: 0.6398423 -0.0426055 0.5457293 debye
polarizability: 329.7131113|10.9825781|220.7831577|12.9627113|-34.101076|132.8168845 unknown
InChI: InChI=1S/C18H18N2O4/c1-2-23-17(22)15(11-12-7-9-13(21)10-8-12)20-18-19-14-5-3-4-6-16(14)24-18/h3-10,15,20-21H,2,11H2,1H3
charge 0 multiplicity 1
42 atoms
O  -3.294372 1.425845 -0.512435
O  2.329669 1.885681 1.221467
O  1.103296 3.330172 -0.143096
O  5.310622 -3.274649 0.766865
N  -0.951283 1.553802 -0.20426
N  -2.183384 -0.476928 0.27665
C  0.35811 1.006095 0.166153
C  0.913944 0.037737 -0.947435
C  2.068609 -0.834623 -0.491963
C  1.282186 2.202896 0.386365
C  -2.071907 0.790072 -0.124818
C  3.389425 -0.631567 -0.965942
C  1.839222 -1.893727 0.423215
C  -4.263464 0.398384 -0.307105
C  -3.576702 -0.753938 0.174693
C  4.456467 -1.449129 -0.542149
C  2.895459 -2.719326 0.862128
C  4.206844 -2.49238 0.37769
C  -5.640575 0.461202 -0.523301
C  -4.309026 -1.923211 0.461198
C  3.357706 2.955138 1.460761
C  -6.365293 -0.724099 -0.229903
C  -5.709671 -1.888858 0.251837
C  4.406775 2.958073 0.347047
H  0.264185 0.42828 1.10241
H  1.186377 0.639221 -1.834148
H  0.051618 -0.59731 -1.222144
H  -0.991825 2.516825 -0.547839
H  3.586943 0.174367 -1.683792
H  0.820746 -2.080109 0.786355
H  5.475434 -1.302131 -0.912482
H  2.698493 -3.536607 1.568687
H  -6.131929 1.364555 -0.894117
H  -3.807294 -2.8215 0.832171
H  2.836172 3.925562 1.533745
H  3.785992 2.674233 2.435251
H  -7.450065 -0.737149 -0.378696
H  -6.304125 -2.783579 0.466769
H  5.206052 3.680575 0.595859
H  4.862905 1.959542 0.238409
H  3.960579 3.260027 -0.615468
H  5.033585 -3.980466 1.402269
