program: Gaussian 09
title: 000271396
version: EM64L-G09RevD.01
frameworkgroup: C1[X(C16H15Cl2NO2)]
method: RPBEPBE
basis: SDD
operation: Freq
keyword: #p
keyword: freq=noraman
keyword: PBEPBE/SDD
title: #p freq=noraman PBEPBE/SDD
converged: YES YES NO NO
title: Mulliken charges:
elementType: Cl Cl O O N C C C C C C C C C C C C C C C C H H H H H H H H H H H H H H H
charge: -0.030015 -0.020343 -0.261875 -0.225301 -0.433518 -0.191858 0.090711 0.536920 0.300966 -0.197881 -0.318984 -0.456795 -0.312254 -0.335417 -0.067998 -0.171792 -0.682078 -0.250360 -0.231702 -0.153139 -0.219155 0.222765 0.334289 0.178261 0.227493 0.258147 0.238293 0.268442 0.276154 0.255092 0.208753 0.233777 0.223354 0.233798 0.236728 0.236522
chargesum: 0.00000
title: Mulliken charges with hydrogens summed into heavy atoms:
elementType: Cl Cl O O N C C C C C C C C C C C C C C C C
charge: -0.030015 -0.020343 -0.261875 -0.225301 -0.099229 0.030906 0.090711 0.536920 0.300966 0.207872 -0.060836 -0.218502 -0.043811 -0.059264 -0.067998 0.083300 -0.016195 -0.016562 0.005026 -0.153139 0.017367
polarizability: 3.05221169e+02 5.19296373e+00 1.86682276e+02 -1.02383676e+01 -3.72053011e+01 1.51497717e+02
1716.lowfreq: -3.5690 -0.0023 -0.0009 -0.0006 2.4459 5.6858 20.8167 26.4093 41.5916
frequency: 20.7875 26.3099 41.5036 46.9224 49.0965 81.1945 83.9746 108.7487 117.3251 142.8439 160.2449 174.1909 182.8200 214.1031 238.0744 253.3821 276.3106 300.6662 329.1729 350.2779 399.0556 411.7591 417.3322 426.2704 435.6867 468.6044 499.4427 556.1347 571.6014 613.3087 633.3758 644.4799 664.6695 672.9040 680.3391 691.2499 695.3858 775.4721 804.4258 807.9813 822.0883 830.9135 852.2227 857.1209 919.4382 928.2842 936.8598 947.0157 981.6130 988.6970 989.8288 991.9714 1009.9634 1028.8040 1034.1092 1088.2827 1111.9705 1118.6144 1127.1180 1130.1530 1159.6068 1175.4936 1190.5397 1221.6889 1246.2297 1250.9206 1284.3178 1291.0597 1318.8721 1342.0547 1362.3857 1374.2651 1390.3728 1394.8978 1407.8960 1437.8858 1460.1109 1467.8583 1477.3517 1480.8531 1488.0051 1505.0966 1563.7352 1578.7639 1601.2859 1612.6174 1615.2794 2930.1019 2954.9796 2994.4811 3015.6924 3092.4968 3102.7620 3132.7336 3139.9569 3144.1185 3155.7813 3165.8777 3170.7043 3174.6629 3177.1997 3463.9730
redmass: 7.7001 7.1576 4.7041 4.2539 4.7515 5.5837 1.7866 8.0487 5.2293 5.8522 4.9487 7.7598 11.5532 6.4401 1.1989 5.2852 5.1120 6.6414 5.5785 5.5047 2.7858 7.0055 6.4808 4.8236 3.0441 5.9602 4.5983 3.0247 4.6510 6.2822 3.6844 2.5843 3.6344 5.0469 2.9279 2.0295 3.5379 2.0715 1.4538 3.2952 1.1691 1.6800 1.4309 2.8796 3.9175 3.3933 1.3525 1.6923 4.1205 1.6807 4.4089 3.8786 1.3590 2.0187 3.2821 1.5711 2.2781 2.0308 3.1107 1.4607 1.5499 1.0622 1.1364 1.7038 1.3702 1.2039 2.2572 1.7182 1.3267 1.6317 1.4864 2.5706 9.0785 1.2628 4.4950 2.2850 1.0409 2.1833 1.0576 2.3044 1.0769 2.3603 7.5680 4.6535 5.7887 6.3439 6.9249 1.0629 1.0822 1.0358 1.0984 1.0991 1.1011 1.0856 1.0894 1.0887 1.0931 1.0963 1.0954 1.1002 1.0914 1.0752
irintensity: 0.2617 0.5719 0.9550 1.0411 1.2607 2.4289 1.4055 0.4293 2.8904 0.1348 0.2414 1.1450 0.7973 6.5207 1.2284 5.8718 0.7392 7.3689 7.5576 1.4829 0.5519 21.6515 18.1219 8.3269 10.8410 9.2671 1.1356 15.1155 9.1131 0.7782 9.4484 71.2849 103.6302 10.6064 0.1268 39.2079 43.5093 15.5242 23.4461 53.2027 3.3434 23.2495 17.7982 42.4214 23.6919 137.7641 1.6698 50.0157 35.9988 3.8526 20.7796 11.0669 1.6869 1.3627 91.9304 8.2664 11.1634 7.3218 141.0724 11.6396 28.0190 1.5177 21.6508 44.5336 13.2120 0.8307 70.1046 88.7084 0.3734 92.5503 12.0057 31.6039 7.2681 20.5865 3.3621 36.0539 12.0379 52.9239 7.4869 25.4764 15.7067 461.0819 163.1298 1.4955 47.0362 48.8160 202.1019 58.5105 50.6715 23.0909 27.7935 29.3897 30.5650 0.1223 7.8228 7.4062 11.8200 23.0645 4.4560 15.0428 4.8159 133.6644
temp: 298.150 k
press: 1.00000 atm
elementType: 17 17 8 8 7 6 6 6 6 6 6 6 6 6 6 6 6 6 6 6 6 1 1 1 1 1 1 1 1 1 1 1 1 1 1 1
symmnumber: 1
zpe: 713437.7 jmol-1
zpe.correction: 0.271734 hartree
zpe.thermalcorrener: 0.292092 hartree
zpe.thermalcorrenthalpy: 0.293036 hartree
zpe.thermalcorrgfe: 0.219664 hartree
zpe.sumelectzpe: -1742.492341 hartree
zpe.sumelectthermal: -1742.471983 hartree
zpe.sumelectthermalent: -1742.471039 hartree
zpe.sumelectthermalfe: -1742.544411 hartree
dipole: 4.2479 0.9880 -0.3377
dipole: 4.3744
quadrupole: -137.4002 -130.0639 -137.1342
quadrupole: 5.4139 -18.2996 -2.2319
quadrupole: -2.5341 4.8022 -2.2681 5.4139 -18.2996 -2.2319
hfenergy: -1742.7640746 hartree
pointgroup: C01 [X(C16H15Cl2N1O2)]
dipole: 1.7112921 0.1660709 0.0758402 debye
polarizability: 299.4007617|33.0053953|134.4982548|-6.7968663|-7.1060084|209.5021459 unknown
InChI: InChI=1S/C16H15Cl2NO2/c1-2-21-16(15(20)11-6-4-3-5-7-11)19-12-8-9-13(17)14(18)10-12/h3-10,16,19H,2H2,1H3
charge 0 multiplicity 1
36 atoms
Cl -3.824042 -0.292524 3.242672
Cl -6.380296 -0.402138 1.152542
O  1.30306 -1.747533 0.16031
O  1.219819 0.198107 -2.460048
N  -0.697379 -0.799045 -0.933254
C  0.535949 -0.540874 -0.244278
C  1.516517 0.170598 -1.229846
C  -1.991862 -0.708143 -0.407019
C  2.752044 0.803437 -0.695957
C  0.581871 -2.635353 1.100318
C  -2.249332 -0.571331 0.986547
C  -3.104725 -0.756878 -1.298716
C  3.14632 0.679053 0.664714
C  3.549544 1.57569 -1.587108
C  -3.573541 -0.471345 1.453308
C  -4.420107 -0.667338 -0.8135
C  1.479036 -3.846329 1.348601
C  4.313123 1.323655 1.124049
C  4.713535 2.217658 -1.12508
C  -4.668417 -0.519492 0.568994
C  5.09661 2.095172 0.233437
H  0.349234 0.085812 0.65457
H  -0.591986 -0.833998 -1.954415
H  0.379973 -2.085639 2.046962
H  -0.386666 -2.936177 0.654804
H  -1.438279 -0.547214 1.717243
H  -2.933406 -0.859447 -2.375937
H  2.564974 0.049544 1.344416
H  3.231359 1.656831 -2.631685
H  -5.265813 -0.704829 -1.506416
H  0.98991 -4.544875 2.051753
H  1.675838 -4.379795 0.403138
H  2.447088 -3.536062 1.778543
H  4.617966 1.220831 2.170896
H  5.321731 2.812963 -1.814384
H  6.00205 2.595808 0.594321
