program: Gaussian 09
title: 000271390
version: EM64L-G09RevD.01
frameworkgroup: C1[X(C22H21NO4S)]
method: RPBEPBE
basis: SDD
operation: Freq
keyword: #p
keyword: freq=noraman
keyword: PBEPBE/SDD
title: #p freq=noraman PBEPBE/SDD
converged: YES YES NO NO
title: Mulliken charges:
elementType: S O O O O N C C C C C C C C C C C C C C C C C C C C C C H H H H H H H H H H H H H H H H H H H H H
charge: 0.956133 -0.523335 -0.522267 -0.418238 -0.205229 -0.504387 -0.160361 0.218113 0.281997 -0.079594 -0.696929 -0.234260 0.222118 0.325576 -0.402050 -0.255953 -0.218179 -0.284913 -0.244087 0.446021 -0.358085 -0.381719 -0.393661 -0.439054 -0.798421 -0.227807 -0.243239 -0.235221 0.298000 0.233514 0.213536 0.259315 0.249978 0.258264 0.285044 0.293023 0.233741 0.232060 0.245552 0.245830 0.303483 0.249214 0.230002 0.230670 0.246234 0.230729 0.224542 0.387088 0.227208
chargesum: 0.00000
title: Mulliken charges with hydrogens summed into heavy atoms:
elementType: S O O O O N C C C C C C C C C C C C C C C C C C C C C C
charge: 0.956133 -0.523335 -0.522267 -0.031150 -0.205229 -0.504387 0.137639 0.218113 0.281997 -0.079594 0.009436 0.015718 0.222118 0.325576 -0.143786 0.029091 0.074845 -0.051171 -0.012027 0.446021 -0.112533 -0.135889 -0.090178 -0.189840 -0.091515 0.002922 -0.018696 -0.008013
polarizability: 3.95544120e+02 1.58164367e+01 2.66543108e+02 2.36872602e+01 1.41415897e+01 2.09807579e+02
1716.lowfreq: -11.0941 -7.0660 -4.6601 -0.0016 -0.0012 0.0016 4.3235 10.8058 30.0594
frequency: -7.8205 10.1424 30.0148 32.6768 41.4228 49.8369 60.2435 67.7660 76.2482 77.7262 102.6452 108.4616 123.0575 130.5033 148.9314 168.8958 200.0238 220.3250 227.6072 243.8957 252.0401 263.0266 279.5121 289.6353 307.5388 312.3195 337.8536 358.2289 384.2343 393.2247 406.5977 407.6567 427.6693 433.2494 492.6215 507.4246 520.4270 536.3089 552.0292 564.1555 576.0529 581.3793 608.8235 617.1754 621.1243 637.9564 700.4953 705.4748 709.6940 718.0392 748.0440 760.3279 773.4937 778.1156 780.0901 797.2795 816.6581 827.3654 849.4895 861.8363 880.0505 920.9204 936.3716 941.2213 960.5360 962.2396 975.6182 981.8219 982.7655 987.8782 988.6903 992.0328 993.2501 995.3369 1013.1379 1035.8469 1040.3497 1046.6859 1049.0972 1063.2978 1083.5662 1107.0711 1115.7259 1117.1853 1137.0403 1172.3072 1174.5547 1182.7417 1199.7433 1216.9251 1227.9903 1254.6549 1283.7908 1289.7857 1295.0387 1316.5445 1328.0257 1352.2349 1361.7385 1372.7089 1379.6023 1388.0275 1390.3822 1400.7647 1418.7868 1438.7620 1462.1043 1466.7662 1470.7265 1471.0448 1473.6917 1475.0481 1493.2259 1564.0032 1583.0774 1591.7709 1593.8362 1595.3240 1609.8143 1664.3843 2981.2663 2989.7633 3005.9585 3063.3786 3079.4960 3092.6355 3111.8784 3115.5162 3127.8800 3129.3413 3133.6327 3139.0354 3139.4380 3140.4886 3149.9376 3152.5760 3158.0253 3163.7794 3166.5682 3168.4418 3510.2600
redmass: 1.2407 2.8508 6.7087 4.9598 6.9666 4.0097 4.6281 6.6295 4.8696 6.1846 5.7142 4.7011 5.0114 4.7655 4.9568 5.0469 5.7405 5.2779 8.7739 2.9123 1.3521 4.3732 5.1758 5.3494 4.5881 4.1515 5.0452 4.2113 4.1696 10.2317 2.8699 2.9893 4.7418 8.3166 3.5266 3.6907 3.8352 3.2440 2.9618 3.5637 2.1271 4.0586 6.8421 6.2175 6.9551 3.0414 5.3696 3.3641 1.9529 4.8984 1.7956 4.4751 4.5102 2.5680 1.7424 7.1090 3.7173 1.4055 1.2456 1.2516 1.4090 3.0942 1.3953 6.1524 1.4186 1.3078 2.0873 1.4090 1.5403 3.3449 2.0877 1.3993 2.5426 7.0469 1.3256 2.2227 2.7934 2.4091 1.5944 2.1316 1.6742 2.1131 1.7936 1.3283 1.8001 1.0539 1.0628 1.1426 1.1310 3.0200 3.1813 1.9563 2.0865 2.0828 1.2775 1.3896 1.4292 4.6431 1.3090 5.6152 5.9752 1.2453 2.8383 1.2265 2.1916 2.3093 1.9879 1.1206 2.2187 1.1169 1.0697 1.0585 2.6233 6.0472 6.0214 6.5016 6.3131 6.0840 5.8992 9.0144 1.0389 1.0364 1.0839 1.0952 1.0994 1.0999 1.0997 1.0858 1.0852 1.0877 1.0889 1.0901 1.0897 1.0922 1.0963 1.0944 1.0959 1.1016 1.1005 1.0960 1.0639
irintensity: 0.0988 1.5209 0.3354 0.2669 0.3784 0.2329 0.2703 0.2292 0.1863 1.0561 1.3193 0.6459 1.9059 1.4403 0.1431 1.9845 1.7854 0.1065 7.1492 3.0441 0.5908 1.0448 3.0329 6.4433 1.7628 1.7479 4.5578 2.8253 1.5256 11.3448 0.0235 1.2263 12.3849 132.8375 14.8962 66.0540 34.2981 20.2313 40.3723 6.8255 141.3560 29.0240 3.8096 2.9787 0.3195 18.2875 6.3457 1.1609 26.3289 45.3322 60.1283 2.7008 4.5710 22.9586 17.7948 38.7877 70.8513 18.3166 0.4299 1.9958 0.3362 14.7900 1.7543 56.7605 12.1074 1.3905 89.4497 1.7715 2.4517 2.8180 1.5614 0.3396 6.5646 13.2184 1.5076 7.3581 59.4217 27.4063 20.3061 30.7994 2.7187 11.5674 15.6940 2.0921 57.9102 0.1542 1.1554 11.6493 3.2017 9.0861 15.3937 4.4033 12.2043 20.2641 2.3868 6.4635 0.4509 6.3319 2.2430 0.6820 0.4066 18.1128 13.4852 16.8930 11.7296 6.9344 42.7113 15.2555 20.8707 17.4308 14.1461 12.6160 0.8744 3.8110 2.3358 4.2949 5.6203 8.8360 0.1694 221.4817 25.5710 14.5032 13.8640 15.8170 28.8757 14.2071 9.6290 4.9248 2.2899 6.7675 11.1885 13.0754 11.6304 24.3951 2.9630 26.5587 5.1565 58.0691 15.1684 6.6060 19.8158
temp: 298.150 k
press: 1.00000 atm
elementType: 16 8 8 8 8 7 6 6 6 6 6 6 6 6 6 6 6 6 6 6 6 6 6 6 6 6 6 6 1 1 1 1 1 1 1 1 1 1 1 1 1 1 1 1 1 1 1 1 1
symmnumber: 1
zpe: 984538.9 jmol-1
zpe.correction: 0.374991 hartree
zpe.thermalcorrener: 0.401315 hartree
zpe.thermalcorrenthalpy: 0.402260 hartree
zpe.thermalcorrgfe: 0.316385 hartree
zpe.sumelectzpe: -1602.479885 hartree
zpe.sumelectthermal: -1602.453561 hartree
zpe.sumelectthermalent: -1602.452617 hartree
zpe.sumelectthermalfe: -1602.538492 hartree
dipole: 4.7662 5.2241 3.9368
dipole: 8.0936
quadrupole: -130.8448 -175.9462 -173.3796
quadrupole: -1.6662 1.9382 -4.1395
quadrupole: 29.2121 -15.8893 -13.3227 -1.6662 1.9382 -4.1395
hfenergy: -1602.8548765 hartree
pointgroup: C01 [X(C22H21N1O4S1)]
dipole: -1.5591878 -2.1931788 1.7024633 debye
polarizability: 387.0019636|38.9441405|272.6770066|-12.0106633|-23.0371995|212.215837 unknown
InChI: InChI=1S/C22H21NO4S/c1-16-12-14-19(15-13-16)28(26,27)23(17(2)22(24)25)21-11-7-6-10-20(21)18-8-4-3-5-9-18/h3-15,17,24H,1-2H3
charge 0 multiplicity 1
49 atoms
S  -1.104764 1.084485 -1.138872
O  -0.416223 0.4112 -2.448005
O  -1.490573 2.667492 -1.069683
O  2.204414 1.487255 2.410515
O  2.09669 3.343128 1.017893
N  0.12111 0.817508 0.300757
C  0.082962 1.913423 1.305021
C  0.444464 -0.54835 0.606179
C  1.748774 -1.066595 0.305349
C  -2.708473 0.121928 -0.840469
C  -0.653477 1.597785 2.624001
C  -0.518956 -1.381429 1.242498
C  1.539631 2.354367 1.532903
C  2.854682 -0.264313 -0.301027
C  2.019618 -2.416343 0.665426
C  -3.735059 0.758733 -0.123679
C  -2.824705 -1.168423 -1.379814
C  -0.227857 -2.718498 1.574387
C  1.053511 -3.23763 1.280987
C  -5.106532 -1.268269 -0.441526
C  -4.937682 0.046266 0.07286
C  -4.038594 -1.859467 -1.167529
C  2.6843 0.509105 -1.479952
C  4.14345 -0.312008 0.303954
C  -6.418025 -2.007164 -0.250026
C  3.773525 1.223361 -2.026151
C  5.229291 0.404203 -0.244191
C  5.046508 1.178963 -1.413618
H  -0.399042 2.767476 0.78994
H  -0.610125 2.475304 3.294522
H  -1.717346 1.374804 2.425137
H  -0.194385 0.743935 3.147125
H  -1.502846 -0.962768 1.477312
H  3.005419 -2.829212 0.425221
H  -3.608085 1.784971 0.236844
H  -2.001876 -1.606858 -1.952601
H  -0.986574 -3.343085 2.057987
H  1.29843 -4.277094 1.525821
H  -5.758485 0.521014 0.622798
H  -4.156685 -2.869796 -1.575286
H  1.709523 0.536366 -1.976375
H  4.28517 -0.899806 1.219169
H  -6.288286 -3.098815 -0.343795
H  -6.862143 -1.796832 0.738742
H  -7.157427 -1.695936 -1.013017
H  3.622624 1.816557 -2.934726
H  6.212128 0.360365 0.239261
H  3.167933 1.736533 2.444292
H  5.885269 1.740263 -1.840562
