program: Gaussian 09
title: 000271378
version: EM64L-G09RevD.01
frameworkgroup: C1[X(C18H24O4S)]
method: RPBEPBE
basis: SDD
operation: Freq
keyword: #p
keyword: freq=noraman
keyword: PBEPBE/SDD
title: #p freq=noraman PBEPBE/SDD
converged: YES YES NO NO
title: Mulliken charges:
elementType: S O O O O C C C C C C C C C C C C C C C C C C H H H H H H H H H H H H H H H H H H H H H H H H
charge: 0.193957 -0.287214 -0.284596 -0.209985 -0.426798 0.358815 -0.136571 -0.082299 -0.448421 -0.466064 0.001328 -0.387286 -0.388417 -0.391042 -0.372409 -0.512674 -0.826628 0.539072 -0.430881 -0.353119 -0.217306 -0.218014 -0.240018 0.266144 0.216417 0.211306 0.204857 0.207463 0.213215 0.233260 0.195984 0.224947 0.227301 0.197037 0.204630 0.188397 0.251974 0.196088 0.271503 0.340068 0.297154 0.260422 0.230152 0.271556 0.225272 0.223820 0.227600
chargesum: 0.00000
title: Mulliken charges with hydrogens summed into heavy atoms:
elementType: S O O O O C C C C C C C C C C C C C C C C C C
charge: 0.193957 -0.287214 -0.284596 -0.209985 -0.086729 0.358815 0.129573 0.134118 -0.032257 -0.045386 0.234588 0.033645 0.035922 0.001985 0.075654 -0.241171 -0.269053 0.539072 -0.200729 -0.081563 0.007966 0.005806 -0.012418
polarizability: 2.78548008e+02 2.21839030e+01 1.83340712e+02 1.72720101e+00 -8.72906729e+00 1.98837608e+02
1716.lowfreq: -11.1875 -4.6149 -0.0022 -0.0019 -0.0017 6.0515 17.6088 20.2588 33.8502
frequency: 15.8052 20.1006 33.7997 42.8221 62.8531 73.7902 79.4059 104.6972 134.3870 163.1548 182.3633 200.7845 226.0647 259.3237 271.1195 284.6254 294.4448 330.2315 342.6499 357.5569 367.2717 404.6605 409.3275 424.8594 441.4814 445.0526 461.4220 467.4805 478.6743 501.2389 515.3723 554.7258 613.1683 629.2330 631.1492 638.3076 704.3024 705.6401 726.8800 768.7899 771.8681 798.5435 802.1621 803.9977 828.2903 849.4449 856.2199 871.1426 876.5159 888.4127 896.2838 910.4317 927.0212 933.0737 947.8098 958.4376 980.5304 980.8454 989.4713 998.3635 1024.7355 1027.0106 1032.0410 1042.2607 1056.2505 1065.0998 1067.5142 1078.4105 1087.2043 1093.2935 1116.2675 1139.4724 1153.9545 1159.3557 1172.5018 1188.8167 1203.0450 1215.5348 1221.6816 1228.2720 1234.9706 1242.1268 1244.7120 1253.8288 1265.1521 1269.8032 1276.4137 1292.0749 1306.6748 1318.2211 1322.6215 1326.5420 1329.4763 1334.7973 1338.1026 1340.4703 1358.0954 1365.7280 1382.3150 1385.1722 1439.2730 1441.7077 1444.6048 1450.2846 1456.6767 1460.1991 1467.7109 1477.1660 1482.9178 1593.4552 1613.0459 2950.4901 2965.4855 2968.6777 2970.3327 2985.2248 2989.3164 2990.7706 2991.7018 2995.2764 3034.3690 3036.1833 3043.6620 3050.7543 3052.0608 3057.5600 3065.8770 3096.5269 3112.8801 3117.0761 3124.7662 3136.8988 3147.4978 3162.6986 3462.5659
redmass: 5.1525 4.5384 3.8638 5.0954 3.9724 5.4083 4.1206 5.3294 3.8600 4.1863 4.2726 5.8022 3.2553 4.7549 2.5194 2.7774 3.6762 2.5954 2.5424 7.2396 2.9466 2.8297 4.6031 3.0807 2.4775 2.8053 1.8422 2.5125 2.6837 3.6904 2.6075 5.5620 5.8181 4.4802 3.8135 5.3399 1.8804 5.6162 5.9054 1.9128 1.5134 3.2231 2.8384 4.3196 3.2922 3.1303 1.2535 1.7985 1.6697 4.0963 2.5358 2.2503 1.4272 1.4907 3.4591 3.8449 2.5943 1.6501 6.0852 1.3271 3.5107 2.2123 3.5722 1.9859 4.0591 2.4237 1.4280 1.5780 3.5835 1.4983 1.8319 1.6991 2.3007 1.0893 1.0504 1.1174 1.1989 1.1751 2.8967 1.5595 1.3948 1.2384 1.3131 1.2975 1.3391 1.2598 1.3722 1.2668 1.2182 1.5981 1.4996 1.3171 1.2643 1.4696 1.4506 1.4541 1.4797 1.3189 1.5282 8.1619 1.7722 1.0940 1.0919 1.2544 1.0990 1.0849 1.0869 1.0891 2.3084 6.0949 5.9997 1.0747 1.0636 1.0800 1.0806 1.0595 1.0661 1.0788 1.0616 1.0636 1.0959 1.0575 1.1008 1.1017 1.0868 1.1027 1.1022 1.0951 1.1068 1.0874 1.0869 1.0919 1.0964 1.1017 1.0648
irintensity: 0.0864 0.0192 0.0688 0.7763 1.0505 0.2176 1.1883 0.5324 1.1431 0.9962 1.1086 4.8368 2.3301 5.5342 7.3388 2.7677 0.8669 11.7034 3.3582 0.9761 8.6608 0.4581 1.1837 0.3838 5.9068 9.6499 77.0241 30.4058 39.0728 7.1611 0.7635 16.5971 4.6715 23.2843 15.3622 8.1907 34.8919 26.7269 4.3309 38.6955 2.3457 56.1242 20.5132 11.0080 23.6906 15.9902 0.3656 10.5834 9.5268 4.9407 40.5711 17.5929 3.3918 8.7069 7.4168 47.5447 39.9745 13.6418 0.0869 0.1122 76.3441 7.2211 39.6393 3.2553 49.8928 119.1191 34.4573 7.3168 71.3448 0.7815 12.9190 3.1602 15.7968 1.2806 0.1690 2.4886 2.9475 23.2298 7.6859 24.4451 19.0104 11.8363 9.9901 19.2839 32.3144 22.3485 4.6985 23.0722 16.9968 6.4080 1.6154 13.9104 0.8780 3.8918 1.2285 0.6426 25.1156 5.6556 12.4604 0.2180 7.1831 9.0358 9.2607 11.5965 3.5672 11.2946 17.2549 9.2374 16.9292 0.5892 3.9312 6.7176 41.8432 46.1191 60.2972 15.3205 30.5836 28.4911 64.8451 15.1744 68.7050 12.7748 49.4386 7.1458 28.7445 27.6174 77.8576 8.1836 1.4282 8.3257 0.9232 17.3801 28.3822 30.9761 21.4566
temp: 298.150 k
press: 1.00000 atm
elementType: 16 8 8 8 8 6 6 6 6 6 6 6 6 6 6 6 6 6 6 6 6 6 6 1 1 1 1 1 1 1 1 1 1 1 1 1 1 1 1 1 1 1 1 1 1 1 1
symmnumber: 1
zpe: 1020615.6 jmol-1
zpe.correction: 0.388732 hartree
zpe.thermalcorrener: 0.410084 hartree
zpe.thermalcorrenthalpy: 0.411028 hartree
zpe.thermalcorrgfe: 0.336237 hartree
zpe.sumelectzpe: -1397.489460 hartree
zpe.sumelectthermal: -1397.468108 hartree
zpe.sumelectthermalent: -1397.467164 hartree
zpe.sumelectthermalfe: -1397.541954 hartree
dipole: -0.7110 0.6071 1.7320
dipole: 1.9682
quadrupole: -140.3966 -143.0976 -138.4701
quadrupole: 2.8013 -6.9048 -11.1383
quadrupole: 0.2582 -2.4428 2.1846 2.8013 -6.9048 -11.1383
hfenergy: -1397.8781917 hartree
pointgroup: C01 [X(C18H24O4S1)]
dipole: -0.276778 -0.0169239 -0.7230036 debye
polarizability: 281.6340884|-11.5651733|187.7674249|-7.766822|-12.5321741|191.3248148 unknown
InChI: InChI=1S/C18H24O4S/c19-15-16-14(21-18(22-16)9-5-2-6-10-18)11-20-17(15)23-12-13-7-3-1-4-8-13/h1,3-4,7-8,14-17,19H,2,5-6,9-12H2
charge 0 multiplicity 1
47 atoms
S  2.099073 1.323648 1.732141
O  -3.016779 0.242981 0.748378
O  -1.956813 0.038459 -1.366682
O  0.687822 1.496994 -0.60528
O  -0.919735 1.259342 2.775974
C  -3.010192 -0.566198 -0.521239
C  -2.001247 1.30798 0.623878
C  -1.809835 1.436768 -0.909646
C  -4.399665 -0.444816 -1.171822
C  -2.628177 -2.020319 -0.21954
C  -0.700139 0.9420 1.368347
C  -5.480171 -1.127158 -0.297518
C  -3.711699 -2.705212 0.648597
C  -5.110099 -2.602022 -0.007856
C  -0.46408 1.996862 -1.376902
C  0.501236 1.751298 0.823899
C  2.461663 -0.401607 0.945378
C  3.791662 -0.418549 0.229424
C  4.877383 -1.173764 0.7394
C  3.964336 0.310912 -0.976737
C  6.114449 -1.207467 0.054336
C  5.196949 0.275626 -1.661317
C  6.276928 -0.484162 -1.14859
H  -2.425207 2.217834 1.08422
H  -2.624043 2.059188 -1.338612
H  -4.35143 -0.932018 -2.165497
H  -4.640094 0.623006 -1.330348
H  -1.645491 -2.035994 0.285391
H  -2.51684 -2.55149 -1.185116
H  -0.490531 -0.136989 1.217079
H  -6.462171 -1.065342 -0.8039
H  -5.56508 -0.574749 0.657982
H  -3.735065 -2.212067 1.639477
H  -3.438985 -3.764759 0.81369
H  -5.871543 -3.061266 0.651153
H  -5.115716 -3.177184 -0.95743
H  -0.270482 1.691087 -2.417225
H  -0.49317 3.106158 -1.317636
H  0.359194 2.834647 1.029005
H  -0.059518 1.090465 3.250454
H  1.626608 -0.567124 0.245266
H  2.419255 -1.134762 1.765491
H  4.754748 -1.738547 1.672152
H  3.126706 0.908587 -1.354828
H  6.946284 -1.795813 0.457977
H  5.320124 0.839803 -2.592902
H  7.234676 -0.508964 -1.680664
