program: Gaussian 09
title: 000271337
version: EM64L-G09RevD.01
frameworkgroup: C1[X(C20H38)]
method: RPBEPBE
basis: SDD
operation: Freq
keyword: #p
keyword: freq=noraman
keyword: PBEPBE/SDD
title: #p freq=noraman PBEPBE/SDD
converged: YES YES NO NO
title: Mulliken charges:
elementType: C C C C C C C C C C C C C C C C C C C C H H H H H H H H H H H H H H H H H H H H H H H H H H H H H H H H H H H H H H
charge: -0.015974 -0.018747 0.001660 0.008079 -0.594787 -0.596437 -0.460341 -0.459183 -0.404914 -0.404970 -0.478507 -0.467768 -0.393696 -0.366831 -0.368536 -0.353291 -0.357028 -0.699712 -0.357000 -0.697197 0.211978 0.212304 0.175452 0.174713 0.206832 0.197345 0.206799 0.197583 0.190569 0.195177 0.190532 0.195294 0.196635 0.191119 0.196551 0.191381 0.204686 0.193941 0.191456 0.201633 0.188686 0.195793 0.185016 0.193116 0.189512 0.187112 0.192944 0.195448 0.188092 0.188496 0.214807 0.209931 0.210009 0.195058 0.194843 0.209774 0.214773 0.209794
chargesum: 0.00000
title: Mulliken charges with hydrogens summed into heavy atoms:
elementType: C C C C C C C C C C C C C C C C C C C C
charge: 0.196004 0.193557 0.177112 0.182792 -0.190611 -0.192055 -0.074595 -0.073357 -0.017160 -0.017037 -0.079880 -0.074678 -0.009217 0.011301 0.008087 0.035101 0.019559 -0.064966 0.032900 -0.062857
polarizability: 2.37182901e+02 -1.00310335e+01 2.15536180e+02 9.49640779e-01 1.15129708e+00 1.81353569e+02
1716.lowfreq: -5.0739 -0.0010 -0.0010 0.0005 5.9657 11.3585 20.9682 34.4766 43.2788
frequency: 19.7706 34.1293 42.2926 49.7593 51.2654 61.3820 76.1982 91.3242 104.7108 112.3506 122.3256 140.9787 152.5674 168.3189 194.0138 217.4694 219.8799 231.2273 237.2834 262.4332 288.6377 324.3311 330.8310 342.1676 358.4382 387.2557 408.3923 429.8543 433.0317 459.3519 479.3826 520.7275 536.4101 562.2112 701.1518 716.0655 723.2279 732.2232 743.7904 758.0792 787.0593 811.9782 819.3586 839.6818 848.3274 877.1542 886.4217 887.9472 898.5541 906.8059 912.8403 926.4995 963.5591 967.1018 980.4565 1001.5502 1011.7395 1016.2000 1018.2300 1043.0111 1051.9344 1056.9823 1060.5024 1069.8385 1072.6144 1073.5878 1080.0260 1081.6129 1091.1140 1105.4328 1112.2964 1126.6724 1140.2348 1147.0678 1154.6989 1175.6150 1191.4327 1195.8038 1210.6993 1216.0179 1226.9207 1233.8853 1246.1747 1249.7349 1251.6148 1268.0365 1273.9731 1275.9734 1277.9680 1284.3492 1286.6805 1288.8841 1294.4653 1300.7268 1306.0836 1306.9422 1324.9051 1326.0074 1330.6051 1331.5720 1338.7200 1340.9037 1342.8410 1346.5019 1349.9092 1352.2522 1355.3681 1359.6290 1362.8094 1367.1801 1385.8932 1387.2324 1456.0113 1460.0148 1461.6627 1462.5273 1463.3489 1465.4570 1466.0569 1467.5705 1470.7358 1471.6292 1474.2742 1474.9800 1475.5460 1476.7040 1480.0014 1483.0815 1487.9930 1488.7012 2921.4946 2934.4796 2941.2370 2942.3299 2949.1170 2949.8243 2950.5972 2951.0740 2951.9682 2953.8597 2956.9879 2959.6633 2961.2248 2961.6691 2962.9176 2964.5017 2967.3307 2968.4628 2970.8502 2971.3936 2984.2840 2990.3558 2993.1640 3000.6710 3002.6951 3006.7260 3011.0112 3013.1002 3014.2841 3021.9021 3023.6141 3032.6966 3033.8220 3038.4273 3067.3064 3068.0638 3069.7267 3070.0152
redmass: 3.3010 3.2885 2.6937 3.0926 1.5488 1.8548 2.9276 2.9304 2.4338 1.7753 2.2658 2.1890 2.9527 2.7448 3.2361 1.2028 1.4254 2.6192 1.6961 2.9228 2.1465 1.9006 2.1077 2.9536 2.2863 3.2079 3.3358 3.0394 3.2217 2.4314 2.3017 2.8847 1.7287 3.3662 2.4597 1.2597 1.1027 1.1836 1.6436 1.6295 1.2212 1.5153 1.5859 1.7921 2.3799 1.3572 1.8475 1.9346 1.7452 1.6223 1.7159 1.5376 2.0337 1.6788 1.5355 2.1963 2.8909 2.2772 2.2959 2.3803 2.0561 1.4673 1.5959 1.9383 2.4064 1.7998 2.0762 1.4793 1.8421 2.0218 2.1908 2.6177 1.9897 1.2538 2.3173 2.3092 1.4502 1.6400 1.4629 1.4006 1.3348 1.3736 1.3162 1.2928 1.2843 1.3276 1.2689 1.2199 1.2539 1.1147 1.0754 1.1568 1.1093 1.2696 1.3523 1.2897 1.3048 1.3872 1.4061 1.4015 1.5821 1.4650 1.5206 1.5415 1.5484 1.6077 1.6671 1.4557 1.5211 1.5412 1.2155 1.2176 1.0824 1.0813 1.0808 1.0775 1.0758 1.0834 1.0804 1.0761 1.0763 1.0811 1.0845 1.0430 1.0442 1.0759 1.0751 1.0849 1.0881 1.0912 1.0784 1.0793 1.0729 1.0669 1.0593 1.0636 1.0621 1.0635 1.0591 1.0602 1.0633 1.0639 1.0615 1.0613 1.0662 1.0719 1.0605 1.0604 1.0365 1.0367 1.0960 1.0957 1.0982 1.1010 1.1001 1.1014 1.1004 1.0986 1.0989 1.0973 1.1038 1.1035 1.1034 1.1042 1.1006 1.1007 1.0992 1.0993
irintensity: 0.0006 0.0048 0.0055 0.0084 0.0044 0.0054 0.0028 0.0123 0.0094 0.0063 0.0056 0.0127 0.0424 0.0363 0.0067 0.0045 0.0428 0.0421 0.0449 0.0962 0.1653 0.1177 0.0525 0.0587 0.0270 0.0728 0.3232 0.1700 0.0229 0.1891 0.0156 0.0331 0.7444 3.0386 7.4970 1.2904 14.8650 0.7860 1.2603 1.4919 0.3596 1.4391 2.0468 3.6708 6.1503 0.2999 9.0115 1.2096 2.5215 1.9764 2.1579 3.4502 7.0983 3.2091 5.0485 1.3133 0.5028 1.3117 4.2778 0.6948 0.2345 0.7337 1.4541 1.5047 0.2614 2.0046 0.1181 1.1102 8.0227 3.6809 0.0440 7.4625 3.0102 0.3674 1.7191 0.3738 8.0415 0.3598 0.2191 1.6626 3.3611 0.7636 0.6752 1.1601 1.8224 0.3373 1.7315 2.3742 0.8481 1.9281 0.1446 1.4425 0.4935 0.4489 0.2994 3.8327 0.0287 0.0340 1.0514 0.2700 0.2958 1.0330 1.4804 0.8448 1.2983 0.3641 0.8364 4.6735 1.6029 1.0763 11.8526 10.9357 1.9104 1.0329 0.2930 1.0309 0.4880 6.9607 4.5781 4.9451 20.2489 5.8186 7.3026 11.4172 10.6592 2.2752 1.0608 2.5800 27.0690 14.0997 0.6282 7.2003 2.7907 11.9347 0.0701 5.3511 14.4850 6.1047 2.5553 30.6289 66.0683 60.8002 57.4386 27.1374 56.8383 3.9219 85.9913 183.7414 33.8702 38.9946 3.2795 7.1678 7.5945 4.3857 21.1908 10.9216 14.2224 178.9133 7.6253 76.1343 1.0280 51.0230 124.5194 168.0630 72.5258 110.4211 75.8082 36.6439
temp: 298.150 k
press: 1.00000 atm
elementType: 6 6 6 6 6 6 6 6 6 6 6 6 6 6 6 6 6 6 6 6 1 1 1 1 1 1 1 1 1 1 1 1 1 1 1 1 1 1 1 1 1 1 1 1 1 1 1 1 1 1 1 1 1 1 1 1 1 1
symmnumber: 1
zpe: 1409427.0 jmol-1
zpe.correction: 0.536822 hartree
zpe.thermalcorrener: 0.560211 hartree
zpe.thermalcorrenthalpy: 0.561155 hartree
zpe.thermalcorrgfe: 0.482267 hartree
zpe.sumelectzpe: -783.288659 hartree
zpe.sumelectthermal: -783.265270 hartree
zpe.sumelectthermalent: -783.264326 hartree
zpe.sumelectthermalfe: -783.343214 hartree
dipole: 0.0061 -0.0130 -0.0012
dipole: 0.0145
quadrupole: -131.7166 -130.6190 -128.9510
quadrupole: 1.1903 0.2649 0.2571
quadrupole: -1.2878 -0.1901 1.4778 1.1903 0.2649 0.2571
hfenergy: -783.8254809 hartree
pointgroup: C01 [X(C20H38)]
dipole: 0.0026464 -0.0050119 -0.0004559 debye
polarizability: 238.0818505|-8.9614124|214.6553956|0.8118757|1.0052534|181.3354043 unknown
InChI: InChI=1S/C20H38/c1-3-5-7-8-12-18-16-20-14-10-9-13-19(20)15-17(18)11-6-4-2/h17-20H,3-16H2,1-2H3
charge 0 multiplicity 1
58 atoms
C  2.192985 -1.238289 -0.640155
C  2.609032 -0.533849 0.679836
C  0.050299 0.220729 -0.756396
C  0.435492 0.886484 0.608487
C  1.317927 -0.294551 -1.497102
C  1.353331 -0.050067 1.443294
C  3.436371 -1.739409 -1.413571
C  3.490657 -1.462105 1.548953
C  4.318801 -2.66668 -0.545249
C  4.729883 -1.972874 0.776109
C  -1.015022 -0.902396 -0.590437
C  1.058573 2.301012 0.422612
C  -2.448111 -0.37931 -0.336744
C  0.017599 3.403184 0.116345
C  -3.484655 -1.512149 -0.161474
C  0.64859 4.799866 -0.085688
C  -4.925739 -0.998966 0.057451
C  -0.40095 5.902665 -0.344289
C  -5.959064 -2.134528 0.236977
C  -7.397901 -1.615777 0.448656
H  1.586924 -2.130803 -0.363527
H  3.222215 0.354353 0.40446
H  -0.411844 1.001717 -1.39871
H  -0.499586 1.031051 1.192077
H  1.944107 0.56641 -1.813492
H  1.010105 -0.811871 -2.429012
H  0.779557 -0.944742 1.765271
H  1.658029 0.472542 2.373347
H  4.035867 -0.861905 -1.739098
H  3.118054 -2.2657 -2.336342
H  2.880884 -2.330791 1.878978
H  3.805076 -0.928258 2.468685
H  5.2192 -2.97858 -1.110136
H  3.752447 -3.591857 -0.308934
H  5.316167 -2.668654 1.407971
H  5.394223 -1.114264 0.543793
H  -0.728412 -1.58591 0.234371
H  -1.026819 -1.522573 -1.511505
H  1.60097 2.580225 1.350511
H  1.819187 2.285643 -0.384137
H  -2.753274 0.268324 -1.185838
H  -2.461958 0.266223 0.565572
H  -0.714198 3.452033 0.950369
H  -0.564176 3.134928 -0.789717
H  -3.188135 -2.149715 0.697996
H  -3.462593 -2.169785 -1.056087
H  1.248114 5.060792 0.81066
H  1.362253 4.75844 -0.933996
H  -5.224743 -0.365721 -0.804217
H  -4.949429 -0.338531 0.949763
H  0.07369 6.890855 -0.488275
H  -0.996572 5.678062 -1.249399
H  -1.104009 5.985672 0.506099
H  -5.660974 -2.764342 1.100217
H  -5.930806 -2.795926 -0.653304
H  -7.46079 -0.978228 1.350821
H  -8.115377 -2.447956 0.572495
H  -7.730769 -1.008046 -0.414047
