program: Gaussian 09
title: 000271315
version: EM64L-G09RevD.01
frameworkgroup: C1[X(C11H16N2O3)]
method: RPBEPBE
basis: SDD
operation: Freq
keyword: #p
keyword: freq=noraman
keyword: PBEPBE/SDD
title: #p freq=noraman PBEPBE/SDD
converged: YES YES NO NO
title: Mulliken charges:
elementType: O O O N N C C C C C C C C C C C H H H H H H H H H H H H H H H H
charge: -0.426357 -0.264335 -0.247939 -0.182257 -0.408210 -0.054264 -0.123755 -0.477722 -0.504956 -0.468517 -0.373241 -0.255146 0.199950 0.222521 0.093729 -0.766743 0.291696 0.224600 0.262614 0.235594 0.239796 0.251729 0.225266 0.214776 0.197025 0.231050 0.267551 0.332908 0.359235 0.248325 0.206420 0.248658
chargesum: 0.00000
title: Mulliken charges with hydrogens summed into heavy atoms:
elementType: O O O N N C C C C C C C C C C C
charge: -0.093449 -0.264335 -0.247939 -0.182257 -0.048975 0.237432 0.100845 0.020486 -0.013431 -0.028475 0.054834 0.012405 0.199950 0.222521 0.093729 -0.063340
polarizability: 1.90718808e+02 6.64724092e+00 1.36766324e+02 7.28855552e+00 3.46443813e+00 9.77489695e+01
1716.lowfreq: -21.5141 -7.4928 -0.0008 -0.0004 0.0001 6.3936 22.2900 40.2108 50.8570
frequency: 19.7492 40.0620 50.8215 90.6168 103.6319 121.2876 148.2245 159.2990 181.3112 216.6482 275.4723 281.6669 286.6097 304.9858 350.7281 380.0953 383.9386 449.4217 464.2863 465.9643 520.6697 591.9913 630.0624 650.6723 699.9342 704.5743 716.7828 745.7749 779.6976 802.7491 828.5533 850.9147 890.7177 895.0575 909.9559 925.2755 959.8793 978.9274 999.1606 1023.0298 1047.4063 1049.8112 1071.6766 1089.0075 1106.3279 1134.1362 1137.4491 1163.8085 1177.8209 1218.4310 1230.4132 1243.4516 1260.6490 1287.4851 1298.4679 1309.2529 1314.6829 1329.7866 1337.3547 1356.1606 1363.4688 1376.1002 1377.9716 1407.0141 1434.5300 1449.3995 1465.8798 1469.5493 1473.3609 1474.7056 1483.2573 1615.7075 1637.3298 1663.7451 2957.7843 2980.3741 2986.0109 2991.7077 3005.5322 3015.2656 3047.4718 3060.3684 3066.9896 3070.0587 3074.6803 3084.5848 3092.8070 3153.9225 3525.8614 3560.0990
redmass: 4.3549 3.6190 6.7772 3.6902 3.5820 1.1042 2.6863 3.3042 4.7073 3.4993 3.6336 3.5468 3.3346 1.1995 2.1768 7.8329 3.6731 3.4200 4.8316 3.4453 3.8022 5.1160 3.1014 2.7449 2.4015 4.1787 4.8607 5.9459 2.1703 2.2618 2.7677 2.5983 1.5626 1.6723 2.8094 2.2358 2.6694 1.6911 1.9296 1.8241 1.6105 1.4636 2.5244 1.4925 3.0637 1.5061 2.6882 1.6803 1.5478 4.4301 1.3804 1.4810 2.2438 1.2796 1.2264 1.3941 1.4213 1.3755 2.0571 1.3630 1.7303 1.2821 2.0213 1.2700 2.3193 1.0436 1.0831 1.0866 1.0813 1.0894 1.0948 6.2172 8.9056 6.0632 1.0685 1.0715 1.0362 1.0663 1.0704 1.0666 1.0997 1.0907 1.0975 1.0968 1.1012 1.0967 1.1004 1.0927 1.0769 1.0661
irintensity: 0.5267 0.1307 0.7050 4.3891 0.0683 0.3040 2.2397 2.0803 3.9991 4.5858 7.6798 20.6742 2.9428 157.7869 6.7217 15.4261 4.3180 7.6439 9.0068 14.3125 4.7553 12.0281 7.2682 1.5450 7.8307 3.8171 4.7111 4.9788 111.2620 10.0201 2.5809 1.7503 3.8584 22.0046 5.0285 6.1357 79.7748 36.8963 3.1669 9.7882 6.5448 7.3767 2.3526 7.5457 22.6022 11.2821 3.2537 12.2340 30.6686 17.4575 0.9148 7.0518 120.8756 10.8025 1.7983 13.6491 25.3623 1.1561 54.1436 16.7351 39.7926 8.6823 26.2130 17.5455 71.0029 11.4522 12.3171 4.1149 10.3239 5.1816 11.6763 202.3442 288.0065 554.3602 67.2428 21.2801 23.6127 41.8254 51.1275 9.6707 27.3912 7.9946 13.3952 48.7883 11.6795 32.9886 15.5126 6.6139 56.1254 6.2988
temp: 298.150 k
press: 1.00000 atm
elementType: 8 8 8 7 7 6 6 6 6 6 6 6 6 6 6 6 1 1 1 1 1 1 1 1 1 1 1 1 1 1 1 1
symmnumber: 1
zpe: 690295.0 jmol-1
zpe.correction: 0.262919 hartree
zpe.thermalcorrener: 0.278615 hartree
zpe.thermalcorrenthalpy: 0.279559 hartree
zpe.thermalcorrgfe: 0.218465 hartree
zpe.sumelectzpe: -762.751763 hartree
zpe.sumelectthermal: -762.736068 hartree
zpe.sumelectthermalent: -762.735123 hartree
zpe.sumelectthermalfe: -762.796217 hartree
dipole: 4.2522 -5.4659 0.3024
dipole: 6.9317
quadrupole: -110.9672 -100.0822 -92.6957
quadrupole: -8.4523 -1.7873 1.6527
quadrupole: -9.7189 1.1662 8.5527 -8.4523 -1.7873 1.6527
hfenergy: -763.0146826 hartree
pointgroup: C01 [X(C11H16N2O3)]
dipole: -1.7231615 2.0999154 0.2417428 debye
polarizability: 190.3516149|8.3162881|137.3983867|-6.8850881|-1.3857513|97.4840998 unknown
InChI: InChI=1S/C11H16N2O3/c1-7-5-13(11(16)12-10(7)15)9-3-2-8(4-9)6-14/h5,8-9,12,14H,2-4,6H2,1H3
charge 0 multiplicity 1
32 atoms
O  -4.688645 -0.8735 -1.244281
O  0.639238 -2.642771 0.270279
O  4.517148 -0.116722 -0.384019
N  0.428496 -0.291789 0.157345
N  2.543222 -1.322563 -0.059055
C  -1.049885 -0.370489 0.34583
C  -3.110282 0.833306 -0.29879
C  -1.845433 0.160063 -0.889132
C  -1.566942 0.447328 1.581304
C  -2.588714 1.475984 1.018194
C  -4.236917 -0.189131 -0.023273
C  1.062482 0.943036 0.010524
C  1.16399 -1.502795 0.132591
C  2.41776 1.101074 -0.171419
C  3.261712 -0.102455 -0.219441
C  3.088078 2.44331 -0.327423
H  -1.243272 -1.445683 0.488012
H  -3.507093 1.603943 -0.990382
H  -2.101291 -0.649118 -1.594053
H  -1.240346 0.906703 -1.437989
H  -0.736402 0.930484 2.125026
H  -2.054841 -0.238006 2.296263
H  -3.398744 1.702358 1.735832
H  -2.085157 2.43443 0.7856
H  -5.0866 0.315486 0.484955
H  -3.881714 -1.007633 0.625809
H  0.398953 1.811931 0.052898
H  -5.079352 -0.203646 -1.861014
H  3.097717 -2.184376 -0.083809
H  3.8503 2.594216 0.458463
H  2.357783 3.269336 -0.275785
H  3.623349 2.503091 -1.29246
