program: Gaussian 09
title: 000271310
version: EM64L-G09RevD.01
frameworkgroup: C1[X(C10H10O3)]
method: RPBEPBE
basis: SDD
operation: Freq
keyword: #pfreq=noraman
keyword: PBEPBE/SDD
title: #p freq=noraman PBEPBE/SDD
converged: YES YES NO NO
title: Mulliken charges:
elementType: O O O C C C C C C C C C C H H H H H H H H H H
charge: -0.392882 -0.136643 -0.171549 -0.423374 -0.418350 -0.559233 -0.503851 0.199119 0.209689 0.225613 -0.116298 -0.504285 0.085870 0.218130 0.220836 0.210371 0.224349 0.223635 0.249318 0.264558 0.238849 0.281401 0.374727
chargesum: 0.00000
title: Mulliken charges with hydrogens summed into heavy atoms:
elementType: O O O C C C C C C C C C C
charge: -0.018155 -0.136643 -0.171549 0.015593 0.016370 -0.086280 -0.000444 0.199119 0.209689 0.225613 -0.116298 -0.222884 0.085870
polarizability: 1.49281455e+02 -1.01166993e+01 1.36715378e+02 2.86249301e-01 -9.90348466e-01 6.29928396e+01
1716.lowfreq: -13.5027 -7.0474 -0.0001 0.0006 0.0008 8.1260 50.2378 91.3888 110.0876
frequency: 50.2249 91.3758 110.0749 163.4933 238.9448 246.5491 283.3286 328.6865 335.6303 346.3104 379.3213 416.9715 424.8212 452.8623 510.4362 531.7189 576.8586 629.6047 641.3643 689.0559 782.7294 814.2035 833.1534 860.5471 876.2652 900.3413 916.4245 981.9646 1038.0943 1080.1451 1099.8787 1120.5723 1130.2035 1136.5574 1173.8543 1187.8152 1235.8304 1248.6870 1263.2627 1273.9050 1323.4627 1340.0414 1347.3466 1356.9725 1374.1777 1443.1886 1449.4331 1470.7599 1473.2826 1537.5529 1577.2626 1599.8870 1645.3315 2930.7914 2973.7057 2974.1595 2987.8454 2997.1583 3040.1742 3054.3640 3061.2918 3181.4453 3559.8523
redmass: 9.3369 3.1024 2.5869 5.7745 2.6054 4.9350 1.9615 4.6799 1.5014 8.0493 6.7041 2.7055 4.0482 6.8550 2.9900 3.1974 5.0285 4.0326 4.8625 4.6216 2.2712 3.0175 1.5605 2.9812 2.0946 1.7242 2.6233 2.7202 3.7550 1.9286 2.2218 1.4961 1.1617 2.1473 1.5323 2.1881 1.6963 1.5286 2.7162 1.4340 1.5786 1.6533 1.5297 1.6256 2.9989 1.1146 1.0804 1.0861 1.0884 10.8926 11.8566 6.8638 7.3935 1.0578 1.0950 1.0679 1.0641 1.0656 1.0919 1.0983 1.1041 1.0928 1.0654
irintensity: 0.0270 2.8657 0.5751 0.1689 3.9651 4.1758 1.9829 10.4818 77.2579 7.5694 5.9229 31.4588 6.1045 8.8039 2.7890 3.0937 1.8906 9.6714 2.6750 10.9462 9.3822 11.9367 9.2925 6.7530 20.2562 3.7020 3.4897 7.7602 16.3269 0.3339 2.4707 59.4878 11.5159 152.7456 1.2131 16.2782 26.3604 2.0484 7.1710 12.3627 32.9356 10.5302 38.8345 1.3132 136.8828 2.5316 19.9977 12.9956 8.9849 252.6447 29.3214 45.2044 45.5517 29.0859 8.5093 7.1490 27.8113 44.6895 8.6570 47.8410 44.7610 0.6372 67.3501
temp: 298.150 k
press: 1.00000 atm
elementType: 8 8 8 6 6 6 6 6 6 6 6 6 6 1 1 1 1 1 1 1 1 1 1
symmnumber: 1
zpe: 467151.0 jmol-1
zpe.correction: 0.177928 hartree
zpe.thermalcorrener: 0.189224 hartree
zpe.thermalcorrenthalpy: 0.190168 hartree
zpe.thermalcorrgfe: 0.140728 hartree
zpe.sumelectzpe: -611.756916 hartree
zpe.sumelectthermal: -611.745620 hartree
zpe.sumelectthermalent: -611.744676 hartree
zpe.sumelectthermalfe: -611.794116 hartree
dipole: -7.9693 3.5230 -0.0537
dipole: 8.7134
quadrupole: -85.2770 -79.6494 -74.3828
quadrupole: 4.0139 -0.3452 0.1753
quadrupole: -5.5072 0.1203 5.3869 4.0139 -0.3452 0.1753
hfenergy: -611.934844 hartree
pointgroup: C01 [X(C10H10O3)]
dipole: 3.1389535 -1.3779935 -0.0132149 debye
dipolederiv: -0.4133516 0.2353591 0.0140456 0.6303575 -1.2179289 -0.0315693 0.0343054 -0.0466974 -0.3889001 -0.4124487 0.0820053 -0.0023865 0.0752831 -0.7918468 -0.0109714 0.006075 -0.0135372 -0.2845168 -0.9118289 0.2378652 0.015376 0.2112744 -0.4444572 -0.006448 0.0098396 -0.0087372 -0.3054343 0.1477679 0.0049725 -0.0191744 0.040971 0.0303776 0.0320189 0.0242787 0.0483315 0.125682 0.07676 0.0420247 0.0129611 -0.0115283 0.035167 0.0250181 -0.0196437 0.0209477 0.136824 -0.1266927 -0.0106156 -0.0157448 0.0004787 -0.0482878 -0.0211374 0.0005844 -0.0882475 0.1480297 -0.0152071 -0.036673 -0.0073215 -0.1075941 -0.1096697 0.0058291 -0.0728541 -0.0430641 0.1207507 0.3847545 -0.2453194 -0.0053112 -0.1936897 -0.1765942 -0.0169882 -0.0371459 -0.0045342 -0.055446 -0.15912 0.4502452 0.0252233 0.2725986 -0.0527063 -0.0011347 0.0650425 0.0325079 -0.0148419 0.5524037 -0.1778106 -0.022432 -0.5183327 1.2674122 0.0581975 -0.0325647 0.0589063 0.1129103 0.5012955 -0.4749655 -0.0077633 -0.1861819 0.7169786 0.021264 -0.0052555 0.0157364 0.1767916 -0.5806274 0.288011 0.011021 0.4967632 -0.4868501 -0.0131196 0.0154686 -0.0073718 -0.2155239 0.7258814 -0.3265107 -0.0160222 -0.6790547 0.7579945 0.0226397 -0.0265455 0.0319913 0.1675475 0.0834401 -0.0114158 0.0380402 -0.0446398 0.0328506 -0.0414419 -0.0263078 -0.0139839 -0.1530875 -0.1812778 0.0790631 0.013412 0.0932307 0.0227164 -0.0081304 0.0443865 -0.0152654 0.0806202 0.0631586 0.0170927 -0.0141974 0.0566669 0.0515578 -0.0593176 0.0376149 -0.0078304 -0.1636328 -0.0972792 -0.1233463 -0.0143823 -0.1421792 -0.0519916 -0.0108724 -0.039555 -0.0283554 0.0795778 0.0496191 -0.008721 0.018326 -0.0070434 -0.1149603 0.1052338 0.0139185 0.1283847 0.0168852 0.0205514 0.0577962 0.018693 0.0255768 0.0342873 -0.0664662 0.005441 -0.0935689 -0.0728431 0.0334832 0.0382163 -0.0350684 0.0203549 0.0106298 0.0723993 -0.0027196 0.0978809 0.0391718 0.0040157 -0.0594148 -0.0030521 -0.0248488 0.055512 -0.0555412 0.0066497 -0.0831686 -0.0759074 0.0405878 -0.0590063 -0.0032592 -0.0252712 0.0234018 -0.0066487 -0.0019099 -0.0118929 0.1875564 0.2141145 0.0011477 -0.0009828 0.0168081 0.4564075 0.0071867 0.000897 0.031568 0.3377865 unknown
polarizability: 149.3327412|-10.0941071|136.6367333|0.2189439|1.6849671|63.0201984 unknown
InChI: InChI=1S/C10H10O3/c11-8-5-9(12)10(13)7-4-2-1-3-6(7)8/h5,11H,1-4H2
charge 0 multiplicity 1
23 atoms
O  -0.216298 -2.985171 -0.141961
O  -1.303556 2.430413 0.040742
O  -3.41293 0.546309 0.01728
C  3.099485 -0.134248 0.392831
C  2.83441 1.182369 -0.366156
C  2.046907 -1.203385 0.01658
C  1.455146 1.753739 0.01961
C  0.624636 -0.654485 -0.01075
C  0.363597 0.700329 0.008766
C  -0.501113 -1.622086 -0.070065
C  -1.046715 1.192836 0.015966
C  -1.828597 -1.254487 -0.06505
C  -2.207399 0.148384 -0.007081
H  3.053712 0.058469 1.482368
H  4.111138 -0.520554 0.171631
H  2.86962 0.992345 -1.457336
H  3.624235 1.921783 -0.141121
H  2.125198 -2.038962 0.746162
H  2.294212 -1.62478 -0.982204
H  1.155439 2.579145 -0.651969
H  1.4970 2.211032 1.029837
H  -2.614739 -2.013054 -0.101997
H  0.75721 -3.166641 -0.127282
