program: Gaussian 09
title: 000271305
version: EM64L-G09RevD.01
frameworkgroup: C1[X(C11H24N2O2)]
method: RPBEPBE
basis: SDD
operation: Freq
keyword: #p
keyword: freq=noraman
keyword: PBEPBE/SDD
title: #p freq=noraman PBEPBE/SDD
converged: YES YES NO NO
title: Mulliken charges:
elementType: O O N N C C C C C C C C C C C H H H H H H H H H H H H H H H H H H H H H H H H
charge: -0.430725 -0.448817 -0.079653 -0.318875 -0.124511 0.292132 -0.196769 -0.342516 -0.354764 -0.390007 -0.400050 -0.400783 -0.717603 -0.763599 -0.718963 0.236874 0.253091 0.192903 0.211559 0.212333 0.169908 0.192245 0.203142 0.202215 0.191100 0.215348 0.189192 0.193614 0.218510 0.210988 0.204996 0.218482 0.256408 0.255780 0.197700 0.205514 0.288206 0.315283 0.360111
chargesum: 0.00000
title: Mulliken charges with hydrogens summed into heavy atoms:
elementType: O O N N C C C C C C C C C C C
charge: -0.115443 -0.088705 -0.079653 -0.030669 0.112363 0.292132 0.056322 0.061945 0.027477 0.005381 -0.006735 0.003757 -0.094492 -0.083713 -0.059968
polarizability: 1.60702241e+02 4.23600299e+00 1.36750351e+02 -2.16191713e+00 -4.38535191e-01 1.23679831e+02
1716.lowfreq: -13.3421 -8.7667 0.0003 0.0005 0.0008 13.5773 35.7879 47.4500 63.7459
frequency: 35.1446 47.3126 63.6930 101.5260 122.4730 134.3021 180.9404 201.4702 207.1318 228.1360 237.9357 248.5204 254.6257 266.1824 273.9345 279.7985 312.2837 324.3225 342.4692 354.7627 368.6257 406.9656 419.7273 443.2692 465.5663 490.1943 507.2536 623.9259 647.5861 731.6680 769.0772 791.2604 807.5999 808.7129 851.1211 858.0927 883.5811 910.7427 921.7545 930.5677 935.9583 944.5895 955.8308 979.8765 1008.3194 1021.5271 1041.0570 1063.0020 1078.5282 1089.0748 1103.6357 1123.8060 1142.9367 1149.2335 1185.6349 1189.2564 1217.2519 1221.3035 1234.7836 1253.1936 1261.6065 1267.3531 1280.7399 1306.3108 1328.9223 1333.1912 1339.4769 1345.1755 1349.4744 1352.7329 1370.4690 1371.2986 1377.7143 1403.1347 1417.8410 1434.1163 1453.7846 1454.4388 1457.3121 1463.4152 1468.4889 1472.6110 1480.8196 1480.9089 1482.5447 1490.9353 1508.4690 2836.9226 2896.1184 2966.5295 2969.9109 2972.5627 2978.4131 2982.7588 2984.8776 3017.2106 3032.7268 3036.4547 3043.6225 3052.9125 3053.9039 3056.0871 3059.5360 3061.9582 3064.6044 3075.9509 3090.7305 3101.0567 3350.1764 3554.2517 3559.4544
redmass: 3.8144 3.2995 3.3885 2.9809 3.3695 3.3479 2.9267 2.7199 1.2409 1.7274 2.2928 1.9754 1.9288 1.5799 1.4477 1.6815 1.5324 1.5351 2.5672 2.2101 2.4815 2.2416 2.5910 2.9012 3.2168 1.9944 2.5516 3.5071 3.0058 4.6845 3.2518 4.0855 1.6539 2.9490 2.0909 1.7185 2.7763 2.0583 1.9110 1.7046 2.4612 1.2808 1.2977 2.4880 1.6332 1.5009 2.1167 2.0790 1.5677 1.5619 2.1076 2.7780 1.3752 1.4385 2.0756 1.6737 2.2734 1.6052 2.4394 1.7093 1.3070 1.2106 1.6628 1.4667 1.2795 1.3133 1.4081 1.4498 1.3849 1.1657 1.2384 1.2966 1.1963 1.2024 1.2268 1.0745 1.0609 1.0916 1.0574 1.0879 1.0946 1.0681 1.0623 1.0778 1.0570 1.0552 1.0549 1.0713 1.0693 1.0629 1.0361 1.0365 1.0367 1.0608 1.0612 1.0845 1.0950 1.0916 1.1029 1.1023 1.0906 1.0927 1.0983 1.0923 1.0961 1.0959 1.0999 1.0981 1.0750 1.0682 1.0653
irintensity: 0.5456 0.3861 0.1392 0.4043 1.1994 0.3526 0.5724 0.0678 1.8616 6.1878 10.8313 13.8271 5.3701 17.0609 21.8259 22.4682 119.7904 83.7493 2.2333 3.1645 3.8224 5.6391 20.1298 2.1570 20.8647 3.3080 0.6179 2.8625 12.6883 58.3585 8.0419 46.8572 11.7346 62.7150 3.9712 3.4483 30.1802 2.1125 4.1677 6.4292 36.8943 7.0021 1.9654 44.5931 30.6502 0.2859 20.6030 22.1092 11.8567 35.2961 11.4131 6.6072 21.5055 15.0037 78.2873 0.6772 13.2175 22.7568 18.1108 33.4703 2.8152 16.7051 6.9450 26.2161 8.8511 9.4644 1.1900 3.4881 1.3843 14.7760 19.1438 10.3669 16.7544 20.2518 6.5230 6.4347 9.7842 7.2219 10.5589 12.7590 10.5761 1.9574 6.8356 2.3572 5.5671 11.1506 19.5663 74.9757 71.9850 38.9579 48.3332 37.6086 32.7730 34.7004 35.8813 13.6884 72.0649 40.0034 24.9636 61.9383 42.4905 40.4925 28.9087 34.5738 45.4350 59.8157 11.5351 18.0189 0.9059 14.9719 2.9441
temp: 298.150 k
press: 1.00000 atm
elementType: 8 8 7 7 6 6 6 6 6 6 6 6 6 6 6 1 1 1 1 1 1 1 1 1 1 1 1 1 1 1 1 1 1 1 1 1 1 1 1
symmnumber: 1
zpe: 905244.6 jmol-1
zpe.correction: 0.344789 hartree
zpe.thermalcorrener: 0.362504 hartree
zpe.thermalcorrenthalpy: 0.363448 hartree
zpe.thermalcorrgfe: 0.300540 hartree
zpe.sumelectzpe: -692.181720 hartree
zpe.sumelectthermal: -692.164005 hartree
zpe.sumelectthermalent: -692.163061 hartree
zpe.sumelectthermalfe: -692.225969 hartree
dipole: 0.2108 -1.9765 -1.4102
dipole: 2.4372
quadrupole: -91.4944 -92.6980 -96.0821
quadrupole: 0.1090 0.3019 -3.5094
quadrupole: 1.9304 0.7268 -2.6573 0.1090 0.3019 -3.5094
hfenergy: -692.5265092 hartree
pointgroup: C01 [X(C11H24N2O2)]
dipole: -0.2808204 -0.8787373 -0.2614435 debye
polarizability: 156.8061481|-3.8735917|128.5074472|-9.244586|7.6866448|135.818829 unknown
InChI: InChI=1S/C11H24N2O2/c1-11(2,3)9(12-15)10(14)13-7-5-4-6-8-13/h9-10,12,14-15H,4-8H2,1-3H3
charge 0 multiplicity 1
39 atoms
O  0.298842 1.606947 -1.060831
O  1.741871 0.60587 2.601003
N  -1.154211 0.362508 0.543281
N  2.383849 0.183951 1.304944
C  1.305101 -0.309481 0.373015
C  2.072339 -0.893043 -0.885628
C  0.193757 0.804624 0.217654
C  -2.09237 1.481584 0.827734
C  -1.773155 -0.716018 -0.259305
C  -3.358693 0.978256 1.549404
C  -3.040583 -1.265226 0.433047
C  -4.048353 -0.13205 0.725547
C  1.115149 -1.442191 -1.978998
C  3.03511 0.156465 -1.517655
C  2.920775 -2.105414 -0.395968
H  0.831005 -1.159128 0.900033
H  0.432549 1.586933 0.957842
H  -2.387346 2.003923 -0.113843
H  -1.560575 2.219686 1.455685
H  -1.043571 -1.533367 -0.382506
H  -2.056158 -0.362591 -1.284896
H  -4.047857 1.829114 1.713248
H  -3.073279 0.579388 2.542134
H  -2.744758 -1.747426 1.385124
H  -3.497813 -2.04171 -0.210654
H  -4.931717 -0.526633 1.262196
H  -4.413916 0.293472 -0.232506
H  0.45298 -0.68082 -2.432617
H  1.721952 -1.866145 -2.80101
H  0.475544 -2.254764 -1.589733
H  3.469884 -0.250853 -2.449636
H  3.879806 0.3794 -0.840144
H  2.513122 1.099303 -1.75356
H  3.597496 -1.799442 0.418158
H  2.272833 -2.9201 -0.018883
H  3.523162 -2.510175 -1.231273
H  2.744579 1.088291 0.946213
H  0.11251 1.01053 -1.829479
H  2.074841 -0.081673 3.233963
