program: Gaussian 09
title: 000271287
version: EM64L-G09RevD.01
frameworkgroup: C1[X(C22H26N4O4)]
method: RPBEPBE
basis: SDD
operation: Freq
keyword: #p
keyword: freq=noraman
keyword: PBEPBE/SDD
title: #p freq=noraman PBEPBE/SDD
converged: YES YES NO NO
title: Mulliken charges:
elementType: O O O O N N N N C C C C C C C C C C C C C C C C C C C C C C H H H H H H H H H H H H H H H H H H H H H H H H H H
charge: -0.517963 -0.479429 -0.477128 -0.428280 -0.425746 -0.439703 -0.090940 -0.209852 -0.111102 -0.282172 -0.184344 -0.272331 0.148565 0.307091 0.290897 0.249431 -0.024439 0.024699 -0.581608 -0.576001 -0.570626 -0.576759 0.386128 0.387027 0.368791 0.375250 -0.824048 -0.820567 -0.825236 -0.821252 0.252719 0.305488 0.242110 0.311666 0.330579 0.325800 0.386610 0.375515 0.387266 0.356004 0.240585 0.244967 0.253130 0.254983 0.224564 0.225398 0.228964 0.228454 0.231179 0.228559 0.221723 0.234810 0.222543 0.236144 0.226211 0.225678
chargesum: 0.00000
title: Mulliken charges with hydrogens summed into heavy atoms:
elementType: O O O O N N N N C C C C C C C C C C C C C C C C C C C C C C
charge: -0.131353 -0.103914 -0.089862 -0.072276 -0.095167 -0.113903 -0.090940 -0.209852 0.141617 0.023316 0.057766 0.039335 0.148565 0.307091 0.290897 0.249431 -0.024439 0.024699 -0.341023 -0.331035 -0.317497 -0.321776 0.386128 0.387027 0.368791 0.375250 -0.145122 -0.132375 -0.146161 -0.133219
polarizability: 4.45980303e+02 2.66077427e+01 2.52524559e+02 -2.55425491e+01 2.35138327e+00 1.91452958e+02
1716.lowfreq: -7.4930 -4.6087 -0.0010 -0.0001 0.0005 1.3615 11.8978 13.4065 27.5414
frequency: 11.5756 13.1575 27.2786 29.3657 49.8793 61.2052 89.1667 98.6604 109.9697 116.9451 121.8334 132.8061 145.0935 148.0244 154.3553 158.9227 179.4909 184.9378 205.8830 242.0092 249.3531 280.1996 288.2176 298.6478 300.7240 321.0264 325.6974 329.3964 332.6037 350.4799 369.4470 372.2691 398.3963 416.3149 435.8322 437.2636 442.8297 453.1773 467.0772 486.7389 506.4132 519.1335 541.9012 566.0279 583.2021 591.9518 619.5793 632.3709 643.2652 653.1360 655.0974 656.6139 716.8413 717.0917 726.4703 727.4521 757.8102 769.9611 773.4102 775.9225 776.6575 795.1542 854.3639 859.3476 860.7092 862.3866 889.9014 891.5983 895.3920 914.6938 919.2237 931.6529 974.9316 985.4409 998.7397 1001.1135 1002.2884 1004.5728 1005.1011 1030.6011 1030.7814 1033.3146 1052.5073 1052.9378 1054.9108 1088.3518 1100.3221 1108.1510 1165.9308 1171.5098 1181.0631 1186.3529 1205.0785 1212.4683 1220.1364 1223.8847 1241.1252 1244.2069 1254.7985 1266.2636 1275.5215 1300.7126 1307.4590 1316.5590 1317.3847 1339.9508 1363.5224 1376.4951 1380.6773 1387.6849 1388.7977 1393.4347 1393.8865 1402.5048 1404.6690 1406.7361 1407.0569 1440.7066 1441.2741 1457.0052 1459.8308 1460.1242 1461.0230 1461.7308 1474.4183 1476.1087 1479.5120 1481.3299 1490.7929 1490.9513 1513.1899 1516.0085 1584.6010 1586.8625 1648.6944 1648.7913 2965.7674 2967.5979 2970.4192 2971.1860 2979.4081 2983.5256 3012.7532 3036.4503 3040.0887 3041.8643 3044.5980 3062.3189 3079.6422 3083.1450 3084.0028 3087.2193 3092.1345 3133.9181 3137.4584 3148.3178 3151.7444 3395.8989 3469.1029 3483.7051 3584.2751 3596.6172
redmass: 4.6718 4.9474 5.1965 3.7677 5.3374 5.8443 5.2497 5.1439 1.1348 5.1806 1.3276 4.7439 2.3158 3.1619 3.4596 1.5515 1.2694 2.0723 4.2776 4.4229 4.9838 5.5753 4.0869 2.6840 2.7404 4.9827 4.7107 4.2447 4.1292 3.8736 4.9608 4.7634 4.5744 4.2778 2.9360 3.7576 3.6409 5.2460 1.1418 5.6339 3.3082 3.8600 1.4479 3.3438 2.5560 1.3104 1.1844 4.6507 4.5951 3.7940 3.8955 4.0082 4.8083 1.2480 5.2507 4.8783 4.8974 3.6460 6.2129 3.3902 5.5072 5.4025 3.0673 3.2218 1.4580 1.4471 1.4487 1.4698 3.9377 1.8116 1.9602 5.5647 5.0655 5.3454 2.3033 1.4256 2.0010 1.5436 1.6528 1.4376 1.4449 3.7237 1.6363 1.6267 3.5034 2.6090 3.6352 4.3728 1.5975 1.5798 1.5604 1.5739 1.7839 4.6376 2.4618 1.2608 1.2293 1.4355 1.3365 1.5175 1.2518 2.1143 3.0428 2.7909 2.2480 1.2640 1.6882 2.1921 1.4375 3.0357 3.2891 1.2553 1.2495 2.7348 1.4169 1.4577 1.3133 2.2161 2.1276 2.3336 1.3269 1.1909 1.2054 1.6067 1.0456 1.0494 1.2410 1.2019 1.7519 1.7171 3.7250 4.3538 8.2249 7.7146 7.6509 7.5557 1.0380 1.0378 1.0378 1.0384 1.0751 1.0763 1.0851 1.0971 1.0969 1.0970 1.0969 1.0859 1.0983 1.0975 1.0983 1.0976 1.0867 1.0923 1.0925 1.0924 1.0925 1.0647 1.0649 1.0654 1.0808 1.0817
irintensity: 1.4763 0.5662 0.9730 1.3347 0.7786 3.5724 0.2382 0.7738 0.0057 1.9310 0.6099 4.1878 1.6455 5.4782 2.3761 5.3976 3.4601 5.3024 15.3129 1.4121 13.5270 13.0879 12.7418 0.3537 1.5447 8.4516 7.7810 1.8750 1.8534 7.9880 0.9499 3.2902 1.3465 1.5435 15.6121 15.6751 7.4912 4.9013 86.7994 23.1107 55.5734 17.0373 194.8406 0.2486 6.6944 45.6083 91.3461 5.5226 8.3986 2.5406 16.1841 6.6967 32.9447 68.0530 1.1010 0.4712 21.3434 0.3242 12.0945 3.7225 27.0194 18.4432 5.0056 32.1874 31.6078 19.6284 5.3876 9.9316 35.2506 195.5655 24.8769 25.3136 38.5947 66.0419 10.3956 50.9815 27.3314 5.9817 10.5240 15.8504 19.8078 48.3782 0.0463 0.0415 66.4241 9.7177 20.8664 14.7359 1.5704 6.7184 24.0000 69.2895 35.6621 9.8908 30.9709 79.1678 11.8592 25.4252 2.7813 7.4704 68.4729 53.7686 5.1285 37.0249 63.0365 13.3276 38.3551 145.0149 48.2542 23.2169 1.1637 10.8301 7.0411 48.2004 24.9601 27.5071 10.8492 14.2315 34.7483 39.9028 45.3705 16.3204 34.3656 39.2794 31.5306 29.3175 4.2483 11.3017 8.6767 6.0989 3.0307 14.9096 8.6456 13.1222 0.6363 1.8845 67.7778 54.9355 125.8397 9.8547 206.2460 539.6963 67.1619 40.9386 6.6704 41.5909 0.0630 15.5026 37.8287 7.4052 36.0195 5.4219 1.2403 16.8395 12.4227 5.8178 5.3701 99.5636 43.4059 31.5663 88.4364 59.5214
temp: 298.150 k
press: 1.00000 atm
elementType: 8 8 8 8 7 7 7 7 6 6 6 6 6 6 6 6 6 6 6 6 6 6 6 6 6 6 6 6 6 6 1 1 1 1 1 1 1 1 1 1 1 1 1 1 1 1 1 1 1 1 1 1 1 1 1 1
symmnumber: 1
zpe: 1182251.6 jmol-1
zpe.correction: 0.450296 hartree
zpe.thermalcorrener: 0.478832 hartree
zpe.thermalcorrenthalpy: 0.479776 hartree
zpe.thermalcorrgfe: 0.389367 hartree
zpe.sumelectzpe: -1371.681791 hartree
zpe.sumelectthermal: -1371.653255 hartree
zpe.sumelectthermalent: -1371.652311 hartree
zpe.sumelectthermalfe: -1371.742720 hartree
dipole: 2.5801 -1.1640 -2.4716
dipole: 3.7578
quadrupole: -130.7042 -170.6790 -183.5864
quadrupole: -6.3337 -4.4216 7.1443
quadrupole: 30.9523 -9.0224 -21.9299 -6.3337 -4.4216 7.1443
hfenergy: -1372.1320867 hartree
pointgroup: C01 [X(C22H26N4O4)]
dipole: 1.0556986 -1.028022 0.1200419 debye
polarizability: 448.9809612|-3.0092202|200.0780379|-25.131511|-23.7118205|240.8988202 unknown
InChI: InChI=1S/C22H26N4O4/c1-9-5-13-14(6-10(9)2)24-21(23-13)19(29)17(27)18(28)20(30)22-25-15-7-11(3)12(4)8-16(15)26-22/h5-8,17-20,23,25,27-30H,1-4H3
charge 0 multiplicity 1
56 atoms
O  -0.473354 1.870337 -2.627585
O  0.751392 2.772616 -0.363794
O  -1.047115 -0.511177 -3.399142
O  0.324209 1.44097 2.171136
N  -3.366943 -0.583285 -1.988964
N  2.606796 -0.736106 1.337574
N  -2.406851 -0.451458 0.074692
N  2.83617 1.132919 0.069622
C  0.018036 0.859499 -1.669231
C  -0.027161 1.510257 -0.268318
C  -0.847223 -0.404474 -1.945318
C  0.503407 0.674464 0.917285
C  -2.193441 -0.448544 -1.254596
C  1.965417 0.347589 0.746457
C  -4.429315 -0.667862 -1.078233
C  3.975648 -0.648811 1.031616
C  -3.810769 -0.578352 0.213696
C  4.103517 0.531549 0.22954
C  -5.823026 -0.807955 -1.227492
C  5.086474 -1.451675 1.355241
C  -4.612374 -0.626657 1.375179
C  5.372292 0.91367 -0.25711
C  -6.618337 -0.858444 -0.060422
C  6.354473 -1.064106 0.867183
C  -6.011119 -0.766494 1.245691
C  6.498027 0.123273 0.057836
C  -8.124965 -1.007002 -0.186565
C  7.573111 -1.906903 1.199307
C  -6.88113 -0.81749 2.49081
C  7.86873 0.526841 -0.457852
H  1.068915 0.610733 -1.924238
H  -1.060342 1.806308 -0.028521
H  -0.269142 -1.295773 -1.637606
H  -0.13234 -0.217608 1.043615
H  -3.369884 -0.645765 -3.006941
H  2.154251 -1.430467 1.930077
H  -0.097147 2.741389 -2.322133
H  1.73125 2.474191 -0.379508
H  -0.968034 0.427708 -3.738846
H  0.591955 2.3783 1.962846
H  -6.292672 -0.876245 -2.214881
H  4.986853 -2.353342 1.969044
H  -4.146744 -0.551024 2.363203
H  5.477078 1.814336 -0.870209
H  -8.489562 -1.920923 0.321237
H  -8.659025 -0.154138 0.275502
H  -8.435335 -1.063606 -1.243964
H  8.338604 -1.319721 1.741899
H  7.304284 -2.772052 1.828688
H  8.061455 -2.294568 0.284531
H  -7.446313 -1.76748 2.558344
H  -6.270518 -0.724753 3.40479
H  -7.629602 -0.00144 2.501841
H  7.811024 1.448955 -1.060028
H  8.57998 0.710121 0.370469
H  8.316435 -0.261925 -1.092656
