program: Gaussian 09
title: 000026050
version: EM64L-G09RevD.01
frameworkgroup: C1[X(C10H15NO)]
method: RPBEPBE
basis: SDD
operation: Freq
keyword: #p
keyword: freq=noraman
keyword: PBEPBE/SDD
title: #p freq=noraman PBEPBE/SDD
converged: YES YES NO NO
title: Mulliken charges:
elementType: O N C C C C C C C C C C H H H H H H H H H H H H H H H
charge: -0.275277 -0.096053 -0.380379 -0.286467 -0.614307 -0.613579 0.365888 -0.351516 -0.378200 -0.223099 -0.197082 -0.258342 0.202925 0.224416 0.223086 0.205791 0.229122 0.190496 0.222073 0.226283 0.192780 0.220147 0.249047 0.248045 0.221981 0.225710 0.226509
chargesum: 0.00000
title: Mulliken charges with hydrogens summed into heavy atoms:
elementType: O N C C C C C C C C C C
charge: -0.275277 -0.096053 0.046963 0.142410 0.027384 0.025630 0.365888 -0.102468 -0.130155 -0.001118 0.028628 -0.031832
polarizability: 1.67499146e+02 -1.31186475e+00 1.11694232e+02 -2.18008445e+00 -7.31894462e+00 7.35474403e+01
1716.lowfreq: -14.0129 -4.5939 0.0003 0.0004 0.0005 2.3142 36.4478 37.2144 73.6540
frequency: 35.7957 36.7104 73.5149 100.6318 129.7189 202.6918 217.8072 231.1694 241.0225 253.6762 344.4645 391.0780 412.6351 427.1903 496.1347 503.4404 572.8298 610.3614 692.4566 758.4202 774.0005 811.6490 827.7985 839.9149 889.7625 960.7418 973.2255 981.2698 986.2305 1021.9091 1035.0848 1036.0232 1062.1205 1082.1148 1089.8748 1094.7608 1138.7076 1164.3518 1166.5793 1177.0609 1220.3765 1246.9260 1269.0089 1290.5373 1312.4714 1328.8131 1380.4286 1393.6512 1421.2191 1443.2827 1444.2151 1461.1376 1468.4109 1469.7702 1476.2610 1479.0328 1485.7805 1487.3830 1591.0322 1612.2933 2854.2837 2863.9526 2892.8880 2965.1651 3020.6943 3026.1578 3028.8639 3055.1127 3079.6776 3084.4877 3126.9490 3135.6647 3154.6007 3163.0378 3172.0993
redmass: 3.1585 3.5349 3.4459 3.2835 2.0962 1.6184 1.1395 4.8959 4.0314 1.5731 2.6883 2.7284 2.9327 2.3119 3.8483 2.8594 6.6103 6.4292 2.0299 1.6595 5.9199 1.2448 1.3896 2.7509 1.4581 1.3587 7.0008 1.2985 6.6424 2.0394 2.2005 1.5611 1.5990 1.5142 1.4185 2.2267 1.4336 1.3866 1.0882 1.1716 3.4115 1.7804 2.5190 1.2322 1.3373 1.3659 2.2996 2.4731 1.1414 1.9330 1.3033 1.0548 1.0875 1.2455 1.0539 1.4399 1.0835 1.1959 6.4500 6.2611 1.0567 1.0577 1.0689 1.0565 1.0730 1.0810 1.0913 1.0973 1.1008 1.1006 1.0847 1.0890 1.0925 1.0953 1.1006
irintensity: 0.2137 1.0856 0.6958 1.1447 3.6292 0.1952 1.0680 0.3971 0.0791 2.5875 13.8685 0.5385 0.0332 0.0348 7.1138 12.5703 7.5033 0.8232 35.3946 91.7810 22.5883 0.9236 3.3916 4.6947 8.4214 0.0980 53.3911 0.6040 25.0875 21.3909 54.4842 20.7154 4.9406 12.7318 13.6232 7.5581 2.8700 14.8280 5.6672 36.1157 223.0556 5.7527 15.6290 3.1180 0.4436 4.1408 5.2046 8.1678 3.5553 0.3399 6.4965 9.5791 11.6064 66.0476 15.1366 78.8257 3.6452 12.3247 24.4226 84.2609 70.3061 166.4523 107.0336 35.5546 39.6792 45.9466 18.2503 40.7137 34.1707 53.1592 2.7928 12.7996 32.7812 23.3037 6.0474
temp: 298.150 k
press: 1.00000 atm
elementType: 8 7 6 6 6 6 6 6 6 6 6 6 1 1 1 1 1 1 1 1 1 1 1 1 1 1 1
symmnumber: 1
zpe: 602622.4 jmol-1
zpe.correction: 0.229527 hartree
zpe.thermalcorrener: 0.242078 hartree
zpe.thermalcorrenthalpy: 0.243022 hartree
zpe.thermalcorrgfe: 0.189533 hartree
zpe.sumelectzpe: -519.076361 hartree
zpe.sumelectthermal: -519.063810 hartree
zpe.sumelectthermalent: -519.062866 hartree
zpe.sumelectthermalfe: -519.116355 hartree
dipole: 1.5208 0.6035 0.2654
dipole: 1.6576
quadrupole: -62.9121 -69.8780 -76.2411
quadrupole: -1.0544 0.9631 -0.1257
quadrupole: 6.7650 -0.2009 -6.5641 -1.0544 0.9631 -0.1257
hfenergy: -519.305888 hartree
pointgroup: C01 [X(C10H15N1O1)]
dipole: -0.5948487 -0.2491395 0.0968234 debye
polarizability: 167.5483042|-0.988074|109.8013874|-0.663371|11.0778862|75.3911267 unknown
InChI: InChI=1S/C10H15NO/c1-11(2)8-9-12-10-6-4-3-5-7-10/h3-7H,8-9H2,1-2H3
charge 0 multiplicity 1
27 atoms
O  0.011913 0.745347 0.20421
N  -3.570176 -0.268106 -0.083158
C  -2.389846 0.599194 0.140287
C  -1.09076 -0.176955 -0.117511
C  -4.766651 0.480079 -0.518475
C  -3.863862 -1.155708 1.061049
C  1.32586 0.276119 0.045299
C  1.661902 -1.021167 -0.417533
C  2.346276 1.200629 0.384075
C  3.025093 -1.381513 -0.535369
C  3.698207 0.825706 0.260675
C  4.048151 -0.468416 -0.199524
H  -2.358997 1.031731 1.169922
H  -2.430712 1.44805 -0.565362
H  -1.04039 -0.489238 -1.178742
H  -1.021531 -1.078931 0.523983
H  -4.534733 1.061754 -1.427902
H  -5.159449 1.186717 0.256111
H  -5.575242 -0.231143 -0.766831
H  -4.672219 -1.857021 0.787313
H  -4.18395 -0.596536 1.9770
H  -2.975125 -1.755106 1.323477
H  0.886103 -1.744037 -0.686505
H  2.056853 2.195143 0.737848
H  3.282386 -2.384903 -0.893751
H  4.481882 1.544902 0.524368
H  5.100316 -0.756592 -0.293955
