program: Gaussian 09
title: 000271267
version: EM64L-G09RevD.01
frameworkgroup: C1[X(C22H15Cl2NO3)]
method: RPBEPBE
basis: SDD
operation: Freq
keyword: #p
keyword: freq=noraman
keyword: PBEPBE/SDD
title: #p freq=noraman PBEPBE/SDD
converged: YES YES NO NO
title: Mulliken charges:
elementType: Cl Cl O O O N C C C C C C C C C C C C C C C C C C C C C C H H H H H H H H H H H H H H H
charge: -0.022236 -0.044334 -0.285299 -0.163921 -0.197282 -0.442106 -0.564192 0.483272 0.140752 0.231063 0.330844 -0.404248 -0.378050 -0.222341 -0.219343 -0.338637 -0.325815 -0.239220 0.197218 0.246744 -0.215259 -0.223793 -0.110365 -0.321351 -0.324960 -0.231995 -0.218011 -0.095835 0.268226 0.249586 0.253228 0.373043 0.232394 0.230572 0.283061 0.252279 0.234473 0.265553 0.264509 0.247903 0.282652 0.259246 0.261974
chargesum: 0.00000
title: Mulliken charges with hydrogens summed into heavy atoms:
elementType: Cl Cl O O O N C C C C C C C C C C C C C C C C C C C C C C
charge: -0.022236 -0.044334 -0.285299 -0.163921 -0.197282 -0.069063 -0.295966 0.483272 0.140752 0.231063 0.330844 -0.154662 -0.124822 0.010053 0.011228 -0.055576 -0.073536 -0.004747 0.197218 0.246744 0.050294 0.040716 -0.110365 -0.073448 -0.042308 0.027251 0.043964 -0.095835
polarizability: 3.93852133e+02 -4.60153494e+00 2.95664359e+02 1.70464432e+01 -3.20138868e+01 1.88502829e+02
1716.lowfreq: -4.1234 -2.4062 0.0014 0.0016 0.0020 2.2965 14.5482 16.4920 23.3967
frequency: 14.4508 16.4118 23.2900 25.2826 31.2392 31.9601 45.4284 71.9156 80.9982 93.8416 98.7685 140.2049 150.3975 159.3931 203.5414 208.4045 229.9054 247.9938 254.8376 272.7217 299.5396 306.9849 320.9047 372.8800 391.0574 402.4449 404.1303 406.8639 427.9831 469.9126 471.6475 482.8583 506.1351 526.9987 535.3002 580.8109 613.4056 622.1034 622.4106 663.1308 676.7076 695.2833 698.5809 710.6233 721.7638 729.8781 749.5964 767.7999 815.5756 826.4366 832.6511 835.9421 850.1975 854.1059 861.1720 869.0789 882.5129 923.5258 930.6575 962.3064 963.0343 979.1724 988.4289 990.2053 991.6476 995.5566 997.6976 999.7293 1015.5499 1029.0045 1069.1091 1074.1994 1079.6863 1087.7040 1114.1529 1115.4692 1164.0852 1173.8835 1177.0594 1187.4489 1195.1321 1197.1493 1218.2895 1245.2119 1253.0777 1295.1775 1305.1797 1328.4253 1337.8250 1371.5672 1373.1332 1382.8230 1397.5172 1403.4605 1441.1912 1469.6362 1476.2067 1479.1301 1494.5128 1532.7667 1574.1986 1579.2150 1592.7970 1596.0298 1596.3740 1605.3122 1632.6457 1665.2741 3064.0234 3127.5211 3130.4028 3136.6690 3142.4558 3152.3160 3156.8904 3158.5904 3159.8862 3168.7383 3171.9833 3177.1583 3177.7070 3180.7327 3285.2204
redmass: 8.0696 6.8014 4.1178 4.9423 5.7859 5.3102 7.0542 9.9023 9.5877 10.5102 8.3143 9.3679 10.1999 6.5898 7.5980 7.1986 8.2410 8.4151 7.0783 7.6960 5.3789 6.6325 9.9227 12.4964 7.3142 2.8266 2.8476 2.8785 7.8870 3.6539 3.8380 3.7022 6.0968 7.0312 6.8017 6.3926 6.4648 7.1472 7.1501 5.7222 4.9309 4.4276 3.4411 2.8109 4.3592 3.8038 3.0365 2.5163 1.7844 1.4703 3.9216 1.4844 1.2757 1.5579 1.7602 4.5263 1.7362 2.4336 2.0208 1.3891 1.4017 1.4338 4.4974 1.4365 1.3810 4.3343 3.4185 1.4532 3.1960 2.3196 5.6357 2.9171 2.5337 1.6469 1.3683 1.3578 3.2275 1.5875 1.3977 1.1608 1.1257 1.1959 1.6083 2.7619 2.7242 1.3213 1.3105 1.5070 1.4101 5.3465 4.5586 7.9754 3.7644 4.3051 2.1797 2.2962 2.3551 2.1830 2.6004 5.5343 7.0706 7.2502 6.0185 6.0533 6.0324 6.0158 3.5813 6.6007 1.0834 1.0853 1.0881 1.0903 1.0920 1.0964 1.0890 1.0885 1.0887 1.1016 1.0955 1.0967 1.0972 1.0979 1.0804
irintensity: 0.2311 0.3109 0.1547 0.2322 0.0497 0.2378 0.3067 4.2602 0.6193 1.6848 1.8403 7.0547 8.9673 1.0394 0.2086 2.4214 1.1264 0.4432 0.3153 0.6024 0.2535 2.1098 4.6126 2.0043 18.2757 0.0188 0.3796 0.1349 17.2843 16.4836 19.0782 4.4893 19.7926 30.3588 25.8687 49.2083 0.8084 1.2695 0.6416 17.0128 8.8684 2.8285 12.6585 28.9705 49.5354 9.1993 34.8717 19.5481 31.8241 5.7254 14.4817 3.3181 34.0102 55.7113 43.1634 49.3976 65.3822 2.2750 2.2810 0.3777 1.5738 0.1280 19.8101 2.9154 3.4963 89.9535 29.7491 4.9634 11.3286 17.2013 30.6821 89.0650 50.2379 4.1156 32.6204 22.5731 104.0740 36.0255 13.0276 50.5939 13.7911 28.8823 75.6237 423.0808 154.5983 18.4069 41.0473 56.0011 35.9431 15.5919 52.0773 1.1165 1.7213 31.9122 8.4296 601.8569 40.7329 24.6305 969.2778 2.2202 35.3938 8.5001 4.2417 157.6670 107.7042 6.6486 74.3190 234.4385 12.9932 3.0569 0.1541 0.6939 8.9213 23.7366 0.3205 2.9452 0.0820 22.0196 1.9317 3.1175 4.2898 1.9665 358.8093
temp: 298.150 k
press: 1.00000 atm
elementType: 17 17 8 8 8 7 6 6 6 6 6 6 6 6 6 6 6 6 6 6 6 6 6 6 6 6 6 6 1 1 1 1 1 1 1 1 1 1 1 1 1 1 1
symmnumber: 1
zpe: 817320.2 jmol-1
zpe.correction: 0.311301 hartree
zpe.thermalcorrener: 0.335927 hartree
zpe.thermalcorrenthalpy: 0.336871 hartree
zpe.thermalcorrgfe: 0.250983 hartree
zpe.sumelectzpe: -2045.973659 hartree
zpe.sumelectthermal: -2045.949033 hartree
zpe.sumelectthermalent: -2045.948089 hartree
zpe.sumelectthermalfe: -2046.033977 hartree
dipole: -4.4756 -1.6985 3.5761
dipole: 5.9753
quadrupole: -174.0907 -172.5111 -183.8725
quadrupole: -8.5640 6.4119 12.1295
quadrupole: 2.7341 4.3137 -7.0477 -8.5640 6.4119 12.1295
hfenergy: -2046.2849599 hartree
pointgroup: C01 [X(C22H15Cl2N1O3)]
dipole: 2.0079507 1.0482704 -0.6292049 debye
polarizability: 383.4860784|-28.6206228|182.6083906|25.9347362|-5.2682904|311.9248524 unknown
InChI: InChI=1S/C22H15Cl2NO3/c23-17-10-6-15(7-11-17)20(26)19(14-4-2-1-3-5-14)22(28)25-21(27)16-8-12-18(24)13-9-16/h1-13,19,25H
charge 0 multiplicity 1
43 atoms
Cl 7.086044 -1.273458 -1.665042
Cl -6.214285 0.879562 -4.482349
O  0.412355 -0.042135 -1.133577
O  -0.984611 -1.680219 2.492813
O  -3.693118 -1.159744 1.539185
N  -1.656715 -0.563841 0.515168
C  0.728853 -0.473079 1.25416
C  0.884267 0.886839 1.971807
C  1.217227 -0.368449 -0.193292
C  -0.735392 -0.985368 1.480088
C  2.656244 -0.604616 -0.502528
C  1.273225 0.89779 3.335091
C  0.603036 2.113219 1.318864
C  1.384767 2.119081 4.034904
C  0.719232 3.333627 2.020912
C  3.055938 -0.595902 -1.869102
C  3.641555 -0.813981 0.502308
C  1.111433 3.341611 3.378866
C  -3.06449 -0.728225 0.538224
C  -3.768923 -0.319076 -0.732771
C  4.398428 -0.80095 -2.23185
C  4.991822 -1.014683 0.153829
C  5.349993 -1.00913 -1.209948
C  -3.110078 -0.032084 -1.959015
C  -5.18545 -0.243328 -0.676794
C  -3.852285 0.331022 -3.103495
C  -5.938471 0.121589 -1.809025
C  -5.255639 0.406411 -3.009085
H  1.338007 -1.214405 1.796713
H  1.460953 -0.049948 3.853009
H  0.29595 2.122083 0.266906
H  -1.20623 -0.130445 -0.310926
H  1.678318 2.115168 5.090281
H  0.501463 4.276755 1.507797
H  2.29225 -0.426233 -2.634176
H  3.374069 -0.80091 1.562802
H  1.198909 4.289216 3.921344
H  4.704998 -0.800517 -3.281365
H  5.751893 -1.170005 0.924256
H  -2.02132 -0.102321 -2.060861
H  -5.67757 -0.4819 0.271472
H  -3.3487 0.546425 -4.04997
H  -7.029158 0.183055 -1.763021
